program: Orca
programVersion: 5.0.2
elementType: Cl N N N N C C C C C C C C C C C C C C C C C C C H H H H H H H H H H H H H H H H H H
charge: 1
multiplicity: 1
keywords: wb97x-d3
keywords: def2-TZVPP
keywords: def2/J RIJCOSX
keywords: DEFGRID2
keywords: scfconv7
keywords: smallprint printgap noloewdin
keywords: NOSOSCF
formula: C19H18ClN4
InChI: InChI=1/C19H18ClN4/c20-18-8-6-16(7-9-18)10-11-19(12-21,13-24-15-22-14-23-24)17-4-2-1-3-5-17/h1-9,14-15,22H,10-11,13H2
42 atoms
Cl -5.2692 0.024887 1.05309
N  0.14553 1.519098 -0.636392
N  1.002947 2.523164 -0.869903
N  -0.511772 2.415298 -2.43322
N  0.533591 -1.385931 -2.227433
C  1.333278 -0.541984 0.110062
C  1.246423 -1.672279 1.175971
C  0.332185 0.593146 0.467034
C  2.750829 0.020189 0.032149
C  0.101026 -2.684193 1.035094
C  -1.279004 -2.086479 1.055691
C  0.91762 -1.059351 -1.193597
C  3.499549 -0.005454 -1.136971
C  3.317024 0.563445 1.183376
C  -2.063046 -2.040575 -0.094185
C  -1.789268 -1.516096 2.220797
C  4.790306 0.505913 -1.155301
C  4.6029 1.074413 1.163657
C  -0.772262 1.434877 -1.574392
C  5.344636 1.048482 -0.009139
C  -3.295365 -1.400924 -0.099453
C  -3.015261 -0.870583 2.232005
C  0.592775 3.066041 -1.967605
C  -3.75829 -0.799257 1.061321
H  1.210612 -1.198675 2.160627
H  2.189751 -2.217847 1.139616
H  -0.64628 0.193701 0.720102
H  0.701232 1.164839 1.315038
H  0.207574 -3.394941 1.858224
H  0.239707 -3.265922 0.121866
H  3.096838 -0.435081 -2.045295
H  2.765581 0.586346 2.116386
H  -1.714755 -2.516825 -1.001959
H  -1.220985 -1.571888 3.142622
H  5.363062 0.471302 -2.072086
H  5.028484 1.489037 2.067409
H  -1.573973 0.713453 -1.623208
H  6.351089 1.44368 -0.024541
H  -3.904656 -1.395672 -0.993646
H  -3.397205 -0.43464 3.144969
H  1.047186 3.914801 -2.451212
H  -1.036962 2.623649 -3.271367
totalener: -1413.88622439 hartree
nucrepener: 2144.34843373 hartree
electener: -3558.23465812 hartree
oneelecener: -6166.73626154 hartree
twoeener: 2608.50160342 hartree
kineticenergy: 1409.06792427 hartree
xcener: -115.514847375673 hartree
chargesum: 1.0000000
charge: -0.035444 0.143605 -0.236900 -0.115160 0.014964 0.822959 -0.255202 -0.210438 -0.188583 -0.109203 0.124316 -0.504013 -0.142825 -0.209690 -0.239028 -0.250884 -0.112232 -0.147031 0.154092 -0.099388 -0.191130 -0.074793 0.157433 0.061328 0.107788 0.127947 0.131526 0.161048 0.121973 0.113176 0.139778 0.119308 0.146019 0.126066 0.144207 0.142642 0.220794 0.147310 0.152204 0.140710 0.189515 0.211235
qa: -0.0354 0.1436 -0.2369 -0.1152 0.0150 0.8230 -0.2552 -0.2104 -0.1886 -0.1092 0.1243 -0.5040 -0.1428 -0.2097 -0.2390 -0.2509 -0.1122 -0.1470 0.1541 -0.0994 -0.1911 -0.0748 0.1574 0.0613 0.1078 0.1279 0.1315 0.1610 0.1220 0.1132 0.1398 0.1193 0.1460 0.1261 0.1442 0.1426 0.2208 0.1473 0.1522 0.1407 0.1895 0.2112
va: 1.2736 3.4090 2.8980 3.5637 3.0387 3.1789 3.9064 3.8759 3.5734 3.8091 3.4468 3.9832 3.8911 4.0495 3.9116 3.9938 3.9855 4.0501 3.9290 3.9608 3.9267 3.9342 3.9131 3.9736 1.0020 1.0105 1.0452 1.0090 1.0053 1.0072 1.0151 1.0139 1.0136 1.0121 0.9997 0.9998 0.9829 0.9959 1.0054 1.0064 0.9808 0.9909
dispersion: -0.025456573 hartree
energy: -1413.911680966673 hartree
dipole: 20.93022 -20.35278 0.57744 -3.20956 5.87017 2.66061 2.15597 -3.60813 -1.45215
magnitude: 3.08562 au
magnitude: 7.84302 debye
