program: Orca
programVersion: 5.0.2
elementType: Cl N N N N C C C C C C C C C C C C C C C C C C C H H H H H H H H H H H H H H H H H H
charge: 1
multiplicity: 1
keywords: wb97x-d3
keywords: def2-TZVPP
keywords: def2/J RIJCOSX
keywords: DEFGRID2
keywords: scfconv7
keywords: smallprint printgap noloewdin
keywords: NOSOSCF
formula: C19H18ClN4
InChI: InChI=1/C19H18ClN4/c20-18-8-6-16(7-9-18)10-11-19(12-21,13-24-15-22-14-23-24)17-4-2-1-3-5-17/h1-9,14-15,22H,10-11,13H2
42 atoms
Cl -0.078618 -5.041125 2.302122
N  0.28257 3.766076 -0.893668
N  -0.596929 4.469924 -0.159743
N  -0.342523 5.360077 -2.127392
N  -0.617235 1.223231 -3.101547
C  0.08345 1.267813 -0.585661
C  -1.223693 1.298672 0.241223
C  0.915499 2.56395 -0.380491
C  1.024737 0.117647 -0.229959
C  -2.184704 0.123237 0.03907
C  -1.710578 -1.191474 0.592191
C  -0.292838 1.21023 -1.998857
C  1.303767 -0.143815 1.108626
C  1.655369 -0.642332 -1.208478
C  -1.738789 -1.431464 1.963179
C  -1.203806 -2.18376 -0.239706
C  2.167996 -1.168412 1.460835
C  2.523206 -1.666639 -0.855421
C  0.444897 4.29665 -2.086474
C  2.776668 -1.93909 0.479539
C  -1.247301 -2.611737 2.498777
C  -0.702882 -3.369721 0.275281
C  -0.97065 5.440376 -0.928138
C  -0.722194 -3.570095 1.645912
H  -1.768158 2.208665 -0.01525
H  -0.95864 1.394284 1.295651
H  1.09563 2.714435 0.682324
H  1.875776 2.468309 -0.88428
H  -2.426019 0.016844 -1.021324
H  -3.118821 0.402451 0.531548
H  0.840175 0.440011 1.89321
H  1.469726 -0.459855 -2.25969
H  -2.141613 -0.681181 2.633974
H  -1.183099 -2.028149 -1.311628
H  2.361213 -1.366516 2.507147
H  2.995302 -2.255423 -1.631215
H  1.09596 3.940699 -2.869279
H  3.445495 -2.743904 0.755424
H  -1.272612 -2.778369 3.567458
H  -0.299976 -4.123445 -0.388064
H  -1.675511 6.21195 -0.667693
H  -0.446017 5.993233 -2.913428
elementType: Cl N C H
totalener: -1413.99012222 hartree
nucrepener: 2141.65480338 hartree
electener: -3555.64492560 hartree
oneelecener: -6162.68175062 hartree
twoeener: 2607.03682502 hartree
cpcmener: -0.11680723 hartree
kineticenergy: 1409.02818829 hartree
xcener: -115.509013125658 hartree
chargesum: 1.0000000
charge: -0.101191 0.120946 -0.302371 -0.094164 -0.063801 0.715243 -0.200800 -0.126207 -0.164195 -0.116893 0.095597 -0.378157 -0.231911 -0.152590 -0.230516 -0.184445 -0.176103 -0.153307 0.178898 -0.143346 -0.140043 -0.175766 0.169148 0.098559 0.115964 0.119606 0.155364 0.167694 0.100412 0.111230 0.145745 0.131237 0.137693 0.139426 0.156678 0.156585 0.231458 0.158005 0.140496 0.141122 0.201487 0.247213
qa: -0.1012 0.1209 -0.3024 -0.0942 -0.0638 0.7152 -0.2008 -0.1262 -0.1642 -0.1169 0.0956 -0.3782 -0.2319 -0.1526 -0.2305 -0.1844 -0.1761 -0.1533 0.1789 -0.1433 -0.1400 -0.1758 0.1691 0.0986 0.1160 0.1196 0.1554 0.1677 0.1004 0.1112 0.1457 0.1312 0.1377 0.1394 0.1567 0.1566 0.2315 0.1580 0.1405 0.1411 0.2015 0.2472
va: 1.2026 3.4510 2.8905 3.5700 3.1029 3.4297 3.8641 3.7981 3.6121 3.8758 3.4813 4.0918 3.9746 3.8728 3.9687 3.9308 3.8884 3.9005 3.9144 3.8687 3.9578 3.9344 3.9218 3.7827 1.0207 1.0048 1.0017 0.9945 1.0141 1.0012 1.0085 1.0190 1.0047 1.0022 0.9943 0.9932 0.9637 0.9906 1.0058 1.0080 0.9758 0.9657
dispersion: -0.026640255 hartree
energy: -1414.016762476465 hartree
dipole: 0.45305 0.12606 0.57911 15.85210 -6.45574 9.39636 -3.90685 1.41029 -2.49655
magnitude: 9.73960 au
magnitude: 24.75608 debye
