program: Orca
programVersion: 5.0.2
elementType: Cl N N N N C C C C C C C C C C C C C C C C C C C H H H H H H H H H H H H H H H H H H
charge: 1
multiplicity: 1
keywords: wb97x-d3
keywords: def2-TZVPP
keywords: def2/J RIJCOSX
keywords: DEFGRID2
keywords: scfconv7
keywords: smallprint printgap noloewdin
keywords: NOSOSCF
formula: C19H18ClN4
InChI: InChI=1/C19H18ClN4/c20-18-8-6-16(7-9-18)10-11-19(12-21,13-24-15-22-14-23-24)17-4-2-1-3-5-17/h1-9,14-15,22H,10-11,13H2
42 atoms
Cl -1.857099 -4.568047 -1.888453
N  2.095175 2.766327 0.631515
N  1.65647 4.033281 0.72148
N  2.704968 3.707126 -1.154688
N  -1.470316 2.948902 1.651555
C  0.389334 1.128559 1.393215
C  0.163356 0.112178 2.539798
C  1.762879 1.794909 1.653215
C  0.386768 0.525346 -0.0067
C  -1.199084 -0.583771 2.574973
C  -1.415051 -1.593639 1.482692
C  -0.650536 2.154524 1.516438
C  1.123751 -0.63187 -0.251494
C  -0.273443 1.135225 -1.067111
C  -0.795656 -2.839061 1.542986
C  -2.202585 -1.302956 0.373749
C  1.16152 -1.187987 -1.519591
C  -0.229103 0.581761 -2.340759
C  2.723498 2.553144 -0.5037
C  0.480179 -0.585604 -2.570014
C  -0.930913 -3.76203 0.517526
C  -2.346374 -2.209213 -0.666112
C  2.040746 4.596964 -0.376645
C  -1.700534 -3.432624 -0.587182
H  0.295987 0.652502 3.479811
H  0.962485 -0.630226 2.502051
H  1.78204 2.306131 2.613655
H  2.535964 1.027633 1.653424
H  -2.000849 0.158214 2.563929
H  -1.266666 -1.083529 3.543919
H  1.666459 -1.120145 0.547785
H  -0.846009 2.042205 -0.916615
H  -0.187161 -3.098224 2.40189
H  -2.70588 -0.345971 0.307172
H  1.721433 -2.099164 -1.685896
H  -0.759142 1.066313 -3.150503
H  3.170227 1.628632 -0.832784
H  0.504984 -1.025305 -3.558642
H  -0.440865 -4.724545 0.581489
H  -2.953344 -1.95809 -1.525789
H  1.870194 5.625156 -0.64804
H  3.11554 3.880739 -2.06571
elementType: Cl N C H
totalener: -1413.99133909 hartree
nucrepener: 2182.72907432 hartree
electener: -3596.72041341 hartree
oneelecener: -6243.80081983 hartree
twoeener: 2647.08040642 hartree
cpcmener: -0.11960518 hartree
kineticenergy: 1409.03997302 hartree
xcener: -115.512853171467 hartree
chargesum: 1.0000000
charge: -0.100796 0.130692 -0.287105 -0.085785 -0.052168 0.768241 -0.225958 -0.126579 -0.271036 -0.101468 0.087829 -0.405992 -0.204222 -0.127768 -0.238395 -0.175837 -0.170520 -0.135669 0.170060 -0.138697 -0.134709 -0.178901 0.160722 0.096748 0.122046 0.118044 0.158041 0.161429 0.100612 0.110846 0.140392 0.134285 0.138611 0.139925 0.157934 0.158494 0.219603 0.159213 0.140493 0.141068 0.200945 0.245334
qa: -0.1008 0.1307 -0.2871 -0.0858 -0.0522 0.7682 -0.2260 -0.1266 -0.2710 -0.1015 0.0878 -0.4060 -0.2042 -0.1278 -0.2384 -0.1758 -0.1705 -0.1357 0.1701 -0.1387 -0.1347 -0.1789 0.1607 0.0967 0.1220 0.1180 0.1580 0.1614 0.1006 0.1108 0.1404 0.1343 0.1386 0.1399 0.1579 0.1585 0.2196 0.1592 0.1405 0.1411 0.2009 0.2453
va: 1.2032 3.4612 2.9014 3.5621 3.1087 3.4235 3.9110 3.8090 3.5669 3.8541 3.4982 4.1416 3.9337 3.7784 3.9701 3.9223 3.8782 3.9024 3.9313 3.8691 3.9592 3.9360 3.9319 3.7817 1.0097 1.0006 1.0106 0.9892 1.0156 1.0015 1.0119 1.0194 1.0042 1.0019 0.9940 0.9913 0.9693 0.9899 1.0058 1.0080 0.9770 0.9667
dispersion: -0.027986544 hartree
energy: -1414.019325635604 hartree
dipole: 8.93739 -2.46802 6.46936 8.99893 -4.45372 4.54521 7.56724 -8.44067 -0.87343
magnitude: 7.95453 au
magnitude: 20.21880 debye
