program: Orca
programVersion: 5.0.2
elementType: N C C C C C C C C C C C C C C C C C C C H H H H H H H H H H H H H H H H H H H H H H H H H H H H H H H H
charge: 1
multiplicity: 1
keywords: wb97x-d3
keywords: def2-TZVPP
keywords: def2/J RIJCOSX
keywords: DEFGRID2
keywords: scfconv7
keywords: smallprint printgap noloewdin
keywords: NOSOSCF
formula: C19H32N
InChI: InChI=1/C19H32N/c1-16(15-20-12-6-5-7-13-20)14-17-8-10-18(11-9-17)19(2,3)4/h8-11,16,20H,5-7,12-15H2,1-4H3
52 atoms
N  -1.358447 2.799023 -0.302628
C  -1.43347 1.317404 -0.523202
C  -2.3814 0.586481 0.419008
C  -0.812471 3.160759 1.046102
C  -0.580811 3.467814 -1.397646
C  -0.785909 4.664747 1.24446
C  -0.554618 4.973486 -1.220708
C  -0.001859 5.363584 0.143033
C  -2.411432 -0.896742 0.010944
C  -3.785616 1.181794 0.40529
C  -1.056111 -1.548316 0.019198
C  2.879543 -3.420043 0.023106
C  1.512288 -2.746119 0.050008
C  -0.390619 -1.852755 -1.16433
C  -0.416192 -1.846718 1.215119
C  0.864733 -2.436343 -1.146623
C  0.841198 -2.434298 1.229453
C  3.875381 -2.520633 -0.720686
C  2.760359 -4.766346 -0.704047
C  3.424783 -3.681299 1.426945
H  -0.416477 0.932161 -0.441266
H  -1.759558 1.179931 -1.557059
H  -1.982016 0.627773 1.437302
H  0.188217 2.727414 1.0977
H  -1.430434 2.671473 1.796013
H  -1.039292 3.177627 -2.34268
H  0.423943 3.0426 -1.366447
H  -1.809507 5.050976 1.286665
H  -0.349526 4.862283 2.224235
H  0.050417 5.392651 -2.02553
H  -1.561588 5.381282 -1.355379
H  -0.049483 6.444175 0.273976
H  1.054877 5.088938 0.207771
H  -2.867677 -0.988698 -0.979728
H  -3.081635 -1.41607 0.700157
H  -3.837819 2.189299 0.82888
H  -4.462276 0.576085 1.006629
H  -4.199135 1.214304 -0.605286
H  -0.868429 -1.655108 -2.117836
H  -0.912038 -1.644898 2.158705
H  1.338161 -2.669441 -2.092197
H  1.287734 -2.663556 2.186861
H  4.860131 -2.98939 -0.752607
H  3.573327 -2.333985 -1.751967
H  3.983751 -1.554979 -0.224365
H  2.429509 -4.651622 -1.736779
H  3.727148 -5.271919 -0.726964
H  2.05114 -5.424919 -0.20141
H  4.402849 -4.158204 1.358682
H  3.55626 -2.76059 1.998436
H  2.781659 -4.351107 2.000088
H  -2.31387 3.161479 -0.347485
totalener: -797.92653481 hartree
nucrepener: 1601.35039698 hartree
electener: -2399.27693179 hartree
oneelecener: -4238.10855291 hartree
twoeener: 1838.83162112 hartree
kineticenergy: 793.88086789 hartree
xcener: -82.868450478264 hartree
chargesum: 1.0000000
charge: 0.190876 -0.225176 0.061611 -0.177319 -0.143046 -0.161291 -0.169365 -0.102992 -0.188452 -0.293953 0.033035 0.246571 -0.066267 -0.207408 -0.171338 -0.143062 -0.142460 -0.290962 -0.285657 -0.330802 0.152693 0.138613 0.065986 0.141747 0.146281 0.133870 0.140794 0.095617 0.111909 0.113149 0.097276 0.106476 0.093739 0.108458 0.120712 0.072089 0.113054 0.112906 0.116913 0.119845 0.120319 0.133472 0.100792 0.087713 0.089758 0.088848 0.097771 0.105081 0.100967 0.092429 0.100732 0.147447
qa: 0.1909 -0.2252 0.0616 -0.1773 -0.1430 -0.1613 -0.1694 -0.1030 -0.1885 -0.2940 0.0330 0.2466 -0.0663 -0.2074 -0.1713 -0.1431 -0.1425 -0.2910 -0.2857 -0.3308 0.1527 0.1386 0.0660 0.1417 0.1463 0.1339 0.1408 0.0956 0.1119 0.1131 0.0973 0.1065 0.0937 0.1085 0.1207 0.0721 0.1131 0.1129 0.1169 0.1198 0.1203 0.1335 0.1008 0.0877 0.0898 0.0888 0.0978 0.1051 0.1010 0.0924 0.1007 0.1474
va: 3.5682 3.8355 3.7258 3.8631 3.8395 3.9010 3.9067 3.8199 3.8588 3.9376 3.5524 3.7599 3.7611 4.0253 4.0416 4.0772 3.9882 3.9198 3.9219 3.9317 1.0094 1.0045 1.0196 1.0017 0.9996 1.0067 1.0001 1.0147 1.0179 1.0180 1.0138 1.0170 1.0151 1.0090 1.0105 1.0066 1.0120 0.9974 1.0123 1.0109 1.0103 1.0040 1.0088 1.0070 1.0061 1.0072 1.0066 1.0051 1.0125 1.0014 1.0012 1.0214
dispersion: -0.024604157 hartree
energy: -797.951138962413 hartree
dipole: 2.33230 -4.16349 -1.83119 7.84305 -3.32814 4.51491 -0.05702 -0.20710 -0.26413
magnitude: 4.87929 au
magnitude: 12.40216 debye
