program: Orca
programVersion: 5.0.2
elementType: N C C C C C C C C C C C C C C C C C C C H H H H H H H H H H H H H H H H H H H H H H H H H H H H H H H H
charge: 1
multiplicity: 1
keywords: wb97x-d3
keywords: def2-TZVPP
keywords: def2/J RIJCOSX
keywords: DEFGRID2
keywords: scfconv7
keywords: smallprint printgap noloewdin
keywords: NOSOSCF
formula: C19H32N
InChI: InChI=1/C14H21.C5H11N/c1-5-6-7-12-8-10-13(11-9-12)14(2,3)4;1-2-4-6-5-3-1/h5,8-11H,6-7H2,1-4H3;6H,1-5H2
52 atoms
N  3.633943 4.179725 -0.764248
C  -4.717352 -2.996366 -0.200243
C  -5.280435 -1.791692 0.258658
C  3.863853 3.953571 0.654608
C  2.247507 4.523086 -1.040237
C  2.921931 2.928505 1.27929
C  1.235008 3.526725 -0.482075
C  1.466426 3.295724 1.008083
C  -3.854234 -2.011529 -1.179771
C  -4.794519 -1.032626 1.404108
C  -2.42397 -1.894992 -0.770021
C  1.776959 -1.491594 0.28251
C  0.307156 -1.661297 -0.08456
C  -1.864696 -0.65305 -0.482177
C  -1.604932 -3.016683 -0.711587
C  -0.52624 -0.542309 -0.145366
C  -0.263522 -2.89916 -0.378159
C  2.522734 -2.823595 0.330483
C  1.879634 -0.833066 1.664298
C  2.451922 -0.598414 -0.765796
H  -4.048762 -3.521682 0.472417
H  -5.353005 -3.638806 -0.79686
H  -6.147581 -1.406732 -0.270401
H  3.750635 4.91196 1.173915
H  4.903734 3.649715 0.794983
H  2.122611 4.62606 -2.120612
H  2.051957 5.512808 -0.612317
H  3.137274 1.940732 0.857117
H  3.107541 2.855129 2.354572
H  0.218477 3.887069 -0.663952
H  1.331027 2.577096 -1.02094
H  0.797938 2.515777 1.384199
H  1.214317 4.208385 1.559561
H  -4.283242 -1.006789 -1.318487
H  -4.015772 -2.481131 -2.151105
H  -5.542409 -1.238716 2.184286
H  -4.824234 0.042397 1.237711
H  -3.828929 -1.363166 1.777272
H  -2.478615 0.238808 -0.528376
H  -2.010257 -3.997721 -0.932809
H  -0.129721 0.442707 0.070543
H  0.334828 -3.79957 -0.352188
H  2.106957 -3.504422 1.075926
H  2.520768 -3.335398 -0.633755
H  3.565962 -2.649618 0.600004
H  2.926257 -0.704519 1.948017
H  1.411753 0.152277 1.689721
H  1.402357 -1.446268 2.431503
H  2.404438 -1.048226 -1.759669
H  1.988262 0.38729 -0.827039
H  3.505516 -0.450215 -0.519361
H  3.861906 3.328429 -1.266729
elementType: N C H
totalener: -797.91573223 hartree
nucrepener: 1549.72968143 hartree
electener: -2347.64541366 hartree
oneelecener: -4136.34649691 hartree
twoeener: 1788.70108325 hartree
cpcmener: -0.10057895 hartree
kineticenergy: 793.79689268 hartree
xcener: -82.792270017872 hartree
chargesum: 1.0000000
charge: -0.304767 -0.044392 0.152017 -0.076845 -0.067303 -0.127434 -0.145006 -0.151839 0.002504 -0.200040 -0.053091 0.392955 -0.109802 -0.203819 -0.189224 -0.132862 -0.138842 -0.360929 -0.367500 -0.341523 0.125387 0.125617 0.194418 0.081892 0.087097 0.086486 0.078947 0.047825 0.077705 0.074384 0.066645 0.081739 0.086482 0.141467 0.147805 0.151499 0.127044 0.117410 0.144803 0.149266 0.123178 0.148494 0.102940 0.101771 0.101707 0.103219 0.089609 0.109883 0.110528 0.066138 0.102330 0.114027
qa: -0.3048 -0.0444 0.1520 -0.0768 -0.0673 -0.1274 -0.1450 -0.1518 0.0025 -0.2000 -0.0531 0.3930 -0.1098 -0.2038 -0.1892 -0.1329 -0.1388 -0.3609 -0.3675 -0.3415 0.1254 0.1256 0.1944 0.0819 0.0871 0.0865 0.0789 0.0478 0.0777 0.0744 0.0666 0.0817 0.0865 0.1415 0.1478 0.1515 0.1270 0.1174 0.1448 0.1493 0.1232 0.1485 0.1029 0.1018 0.1017 0.1032 0.0896 0.1099 0.1105 0.0661 0.1023 0.1140
va: 2.9476 3.9225 3.6049 3.9767 3.9686 3.8090 3.8183 3.8507 3.8731 3.9663 3.6480 3.5369 3.7740 3.9955 3.9990 3.9667 3.8877 3.9319 3.9384 3.9440 1.0133 1.0151 0.9776 1.0018 1.0046 1.0045 1.0015 1.0219 1.0178 1.0189 1.0067 1.0081 1.0115 1.0048 0.9979 0.9959 1.0043 1.0035 0.9990 0.9990 1.0074 0.9973 1.0003 1.0001 1.0063 1.0006 1.0023 1.0085 1.0105 1.0072 1.0010 1.0309
dispersion: -0.024097840 hartree
energy: -797.939830069769 hartree
dipole: 5.53955 -14.28293 -8.74338 6.23233 -10.16913 -3.93680 5.15583 -4.97138 0.18446
magnitude: 9.59058 au
magnitude: 24.37731 debye
