program: Orca
programVersion: 5.0.2
elementType: Cl O N N N C C C C C C C C C C C C C C C C C H H H H H H H H H H H H H H H H H H H H H H H
charge: 1
multiplicity: 1
keywords: wb97x-d3
keywords: def2-TZVPP
keywords: def2/J RIJCOSX
keywords: DEFGRID2
keywords: scfconv7
keywords: smallprint printgap noloewdin
keywords: NOSOSCF
formula: C17H23ClN3O
InChI: InChI=1/C17H23ClN3O/c1-16(2)8-7-14(9-13-3-5-15(18)6-4-13)17(16,22)10-21-12-19-11-20-21/h3-6,11-12,14,20,22H,7-10H2,1-2H3
45 atoms
Cl 5.02585 0.842899 0.804337
O  -1.294433 0.260383 -1.526663
N  -0.372537 -2.061268 -0.253803
N  -0.222143 -2.158613 -1.577356
N  -0.031026 -4.164181 -0.754435
C  -1.639006 0.093879 -0.153349
C  -3.082356 -0.476081 0.001906
C  -1.693221 1.459484 0.584477
C  -3.91868 0.790641 -0.236966
C  -3.164014 1.923731 0.4622
C  -0.51644 -0.77064 0.421464
C  -0.703929 2.528631 0.102626
C  -3.326047 -0.980746 1.427952
C  -3.468044 -1.581829 -0.978463
C  0.743963 2.159588 0.263511
C  -0.237858 -3.293222 0.218487
C  1.541662 1.852231 -0.834153
C  1.315207 2.082777 1.532025
C  2.860634 1.45346 -0.6770
C  2.629235 1.680886 1.708004
C  -0.033327 -3.441529 -1.857033
C  3.396397 1.356575 0.598136
H  -1.473028 1.269224 1.640037
H  -4.939448 0.671253 0.127629
H  -4.02048 0.988232 -1.310621
H  -3.239749 2.858966 -0.094191
H  -3.582233 2.126438 1.447757
H  -0.696283 -0.99438 1.469844
H  0.443952 -0.259458 0.349155
H  -0.912911 3.433341 0.680146
H  -0.909353 2.796028 -0.936325
H  -3.061751 -0.255262 2.198283
H  -4.383452 -1.209886 1.560082
H  -2.785064 -1.905653 1.640458
H  -2.965567 -2.529598 -0.77649
H  -4.536116 -1.783719 -0.89024
H  -3.289962 -1.312976 -2.019791
H  -1.961106 0.789616 -1.97682
H  -0.288461 -3.521911 1.271949
H  1.13294 1.932052 -1.833559
H  0.730457 2.351119 2.404766
H  3.472698 1.229818 -1.540148
H  3.060124 1.632419 2.698636
H  0.099112 -3.810763 -2.862089
H  -0.410617 -1.325042 -2.138543
totalener: -1361.19739153 hartree
nucrepener: 2064.01117981 hartree
electener: -3425.20857134 hartree
oneelecener: -5937.95085515 hartree
twoeener: 2512.74228381 hartree
kineticenergy: 1356.48029398 hartree
xcener: -110.352768503500 hartree
chargesum: 1.0000000
charge: -0.038221 -0.420326 0.092796 -0.050358 -0.273211 0.375926 0.237126 -0.113237 -0.274475 -0.146996 -0.298343 -0.154759 -0.352431 -0.325357 0.115163 0.144363 -0.250628 -0.245980 -0.098996 -0.099482 0.176459 0.045821 0.085758 0.101535 0.093731 0.098179 0.107848 0.136549 0.185025 0.129758 0.086364 0.119776 0.117777 0.079718 0.086323 0.128479 0.086430 0.201569 0.177262 0.110457 0.123758 0.136189 0.138803 0.189221 0.234638
qa: -0.0382 -0.4203 0.0928 -0.0504 -0.2732 0.3759 0.2371 -0.1132 -0.2745 -0.1470 -0.2983 -0.1548 -0.3524 -0.3254 0.1152 0.1444 -0.2506 -0.2460 -0.0990 -0.0995 0.1765 0.0458 0.0858 0.1015 0.0937 0.0982 0.1078 0.1365 0.1850 0.1298 0.0864 0.1198 0.1178 0.0797 0.0863 0.1285 0.0864 0.2016 0.1773 0.1105 0.1238 0.1362 0.1388 0.1892 0.2346
va: 1.2692 1.9967 3.4047 3.4346 3.0655 3.6619 3.6599 3.9051 3.9470 3.8694 3.8821 3.8884 3.9629 3.9335 3.4565 4.0037 3.9835 4.0090 3.9525 3.9558 3.9559 4.0077 1.0142 1.0270 1.0141 1.0190 1.0115 0.9936 1.0170 1.0039 1.0174 0.9985 1.0110 1.0021 1.0004 1.0107 1.0173 1.0451 0.9876 1.0269 1.0138 1.0091 1.0079 0.9793 1.0254
dispersion: -0.027917804 hartree
energy: -1361.225309338458 hartree
dipole: -39.29365 36.89499 -2.39866 1.67780 -3.25884 -1.58104 -0.07685 -0.88347 -0.96033
magnitude: 3.02911 au
magnitude: 7.69938 debye
