program: Orca
programVersion: 5.0.2
elementType: Cl O N N N C C C C C C C C C C C C C C C C C H H H H H H H H H H H H H H H H H H H H H H H
charge: 1
multiplicity: 1
keywords: wb97x-d3
keywords: def2-TZVPP
keywords: def2/J RIJCOSX
keywords: DEFGRID2
keywords: scfconv7
keywords: smallprint printgap noloewdin
keywords: NOSOSCF
formula: C17H23ClN3O
InChI: InChI=1/C17H23ClN3O/c1-16(2)8-7-14(9-13-3-5-15(18)6-4-13)17(16,22)10-21-12-19-11-20-21/h3-6,11-12,14,20,22H,7-10H2,1-2H3
45 atoms
Cl 4.521349 4.624109 1.677152
O  -1.083006 -1.137555 -1.84002
N  -1.606037 -3.409253 -0.250655
N  -1.812192 -3.759505 -1.522573
N  -2.913466 -5.160532 -0.280889
C  -1.183031 -0.959693 -0.437121
C  -2.593363 -0.443967 -0.01998
C  -0.240359 0.162129 0.053602
C  -2.493104 1.044359 -0.410735
C  -1.02687 1.460158 -0.207213
C  -0.750252 -2.297999 0.149667
C  1.158536 0.154692 -0.564676
C  -2.810155 -0.561595 1.491459
C  -3.770866 -1.110546 -0.727526
C  2.012481 1.263492 -0.01311
C  -2.281096 -4.281134 0.480487
C  2.34624 2.368276 -0.789556
C  2.475659 1.223081 1.3005
C  3.115575 3.405813 -0.281583
C  3.2426 2.249272 1.828129
C  -2.611822 -4.809945 -1.519018
C  3.557555 3.336881 1.02802
H  -0.121318 0.03457 1.133514
H  -3.188398 1.646391 0.176192
H  -2.789612 1.181605 -1.455184
H  -0.644692 1.971749 -1.092845
H  -0.909452 2.156803 0.622167
H  -0.768005 -2.283797 1.236186
H  0.265871 -2.544884 -0.16248
H  1.090873 0.260743 -1.648092
H  1.650878 -0.802132 -0.370412
H  -2.033156 -0.073186 2.080798
H  -3.755838 -0.086824 1.758143
H  -2.875451 -1.599756 1.822769
H  -3.962472 -2.125366 -0.375054
H  -4.679825 -0.541087 -0.521856
H  -3.657307 -1.139754 -1.811466
H  -1.456723 -0.381835 -2.307767
H  -2.285197 -4.244412 1.558418
H  2.005585 2.425975 -1.816108
H  2.239444 0.373766 1.930741
H  3.36478 4.253342 -0.905683
H  3.59274 2.197372 2.850199
H  -2.947976 -5.287809 -2.425284
H  -1.450203 -3.190855 -2.285525
elementType: Cl O N C H
totalener: -1361.29618575 hartree
nucrepener: 1972.56547309 hartree
electener: -3333.86165884 hartree
oneelecener: -5755.00815257 hartree
twoeener: 2421.14649373 hartree
cpcmener: -0.10615153 hartree
kineticenergy: 1356.44824640 hartree
xcener: -110.344642804971 hartree
chargesum: 1.0000000
charge: -0.100457 -0.458492 0.087158 -0.026464 -0.357126 0.377543 0.270905 -0.080883 -0.259941 -0.199064 -0.187867 -0.095983 -0.364240 -0.361032 0.017361 0.164329 -0.194355 -0.215170 -0.161805 -0.161477 0.191376 0.100706 0.101562 0.083744 0.097759 0.090190 0.097236 0.137159 0.166351 0.086008 0.103214 0.112679 0.105261 0.093841 0.091941 0.115578 0.094812 0.230630 0.192048 0.138894 0.140676 0.142413 0.141427 0.202402 0.249155
qa: -0.1005 -0.4585 0.0872 -0.0265 -0.3571 0.3775 0.2709 -0.0809 -0.2599 -0.1991 -0.1879 -0.0960 -0.3642 -0.3610 0.0174 0.1643 -0.1944 -0.2152 -0.1618 -0.1615 0.1914 0.1007 0.1016 0.0837 0.0978 0.0902 0.0972 0.1372 0.1664 0.0860 0.1032 0.1127 0.1053 0.0938 0.0919 0.1156 0.0948 0.2306 0.1920 0.1389 0.1407 0.1424 0.1414 0.2024 0.2492
va: 1.2042 1.9697 3.3902 3.4657 3.0374 3.8224 3.6887 3.8760 3.9950 3.9062 3.8768 3.7950 3.9617 3.9310 3.5468 3.9860 3.9618 3.9791 4.0056 4.0023 3.9470 3.8292 1.0124 1.0164 1.0039 1.0125 1.0056 0.9905 0.9915 1.0305 1.0139 0.9994 1.0051 1.0000 1.0006 1.0040 1.0154 1.0152 0.9832 1.0061 1.0041 1.0061 1.0069 0.9744 0.9952
dispersion: -0.026038628 hartree
energy: -1361.322224374784 hartree
dipole: -28.53235 24.90396 -3.62839 -13.08060 7.73946 -5.34114 -5.15797 3.31300 -1.84497
magnitude: 6.71542 au
magnitude: 17.06925 debye
