program: Orca
programVersion: 5.0.2
elementType: Cl O N N N C C C C C C C C C C C C C C C C C H H H H H H H H H H H H H H H H H H H H H H H
charge: 1
multiplicity: 1
keywords: wb97x-d3
keywords: def2-TZVPP
keywords: def2/J RIJCOSX
keywords: DEFGRID2
keywords: scfconv7
keywords: smallprint printgap noloewdin
keywords: NOSOSCF
formula: C17H23ClN3O
InChI: InChI=1/C17H23ClN3O/c1-16(2)8-7-14(9-13-3-5-15(18)6-4-13)17(16,22)10-21-12-19-11-20-21/h3-6,11-12,14,20,22H,7-10H2,1-2H3
45 atoms
Cl 4.821188 3.177347 1.678398
O  -2.198404 -0.803145 -1.887144
N  -1.048758 -2.815772 -0.315916
N  -0.778892 -3.149921 -1.580615
N  0.720781 -4.099932 -0.328243
C  -2.21334 -0.612674 -0.484371
C  -3.487885 0.163974 -0.029444
C  -1.033099 0.271706 0.01197
C  -3.069348 1.60987 -0.31853
C  -1.612586 1.702203 0.136293
C  -2.206611 -2.027194 0.088881
C  0.226769 0.222661 -0.863356
C  -3.739146 0.000361 1.473697
C  -4.749362 -0.235718 -0.784562
C  1.37265 0.968469 -0.235454
C  -0.127085 -3.414309 0.42169
C  2.079415 0.411594 0.828717
C  1.756526 2.226587 -0.688717
C  3.137042 1.08069 1.42312
C  2.811192 2.915516 -0.105437
C  0.296233 -3.916886 -1.566438
C  3.494772 2.333473 0.948124
H  -0.754749 -0.085164 1.00808
H  -3.71962 2.328648 0.183309
H  -3.151062 1.820703 -1.389908
H  -1.054752 2.420205 -0.466474
H  -1.545862 2.051723 1.166983
H  -3.09812 -2.579452 -0.214349
H  -2.171147 -2.013421 1.174477
H  0.019357 0.653155 -1.845574
H  0.544521 -0.807877 -1.035545
H  -4.111028 -0.995281 1.723394
H  -2.853574 0.185821 2.08447
H  -4.503396 0.710277 1.794304
H  -4.674022 -0.052049 -1.856207
H  -5.001542 -1.289093 -0.641045
H  -5.597922 0.345518 -0.41827
H  -2.138877 0.041372 -2.34833
H  -0.110916 -3.330148 1.497056
H  1.809744 -0.569977 1.201087
H  1.23188 2.681991 -1.520075
H  3.67747 0.626946 2.243206
H  3.09452 3.8914 -0.476672
H  0.736989 -4.316305 -2.465736
H  -1.313075 -2.760281 -2.353388
elementType: Cl O N C H
totalener: -1361.29534283 hartree
nucrepener: 2004.32058399 hartree
electener: -3365.61592682 hartree
oneelecener: -5818.09890353 hartree
twoeener: 2452.48297671 hartree
cpcmener: -0.10755074 hartree
kineticenergy: 1356.42989107 hartree
xcener: -110.339765827374 hartree
chargesum: 1.0000000
charge: -0.099515 -0.445857 0.078683 -0.033228 -0.356211 0.336663 0.256461 -0.087561 -0.249838 -0.182858 -0.144531 -0.087640 -0.380177 -0.330411 0.036607 0.167118 -0.227778 -0.215702 -0.156636 -0.152575 0.192878 0.095704 0.092743 0.085974 0.086160 0.082736 0.104426 0.168268 0.128121 0.103408 0.093976 0.101305 0.108348 0.103749 0.088724 0.094938 0.107065 0.225911 0.191700 0.144320 0.141930 0.140421 0.141913 0.202048 0.248223
qa: -0.0995 -0.4459 0.0787 -0.0332 -0.3562 0.3367 0.2565 -0.0876 -0.2498 -0.1829 -0.1445 -0.0876 -0.3802 -0.3304 0.0366 0.1671 -0.2278 -0.2157 -0.1566 -0.1526 0.1929 0.0957 0.0927 0.0860 0.0862 0.0827 0.1044 0.1683 0.1281 0.1034 0.0940 0.1013 0.1083 0.1037 0.0887 0.0949 0.1071 0.2259 0.1917 0.1443 0.1419 0.1404 0.1419 0.2020 0.2482
va: 1.2048 1.9852 3.4141 3.4641 3.0356 3.8836 3.7392 3.8599 3.9855 3.9165 3.8566 3.7838 3.9566 3.9361 3.5369 3.9796 3.9878 3.9907 4.0143 3.9987 3.9489 3.8285 1.0175 1.0183 1.0130 1.0199 1.0006 0.9884 0.9949 1.0182 1.0141 0.9970 0.9971 1.0059 1.0167 1.0033 1.0006 1.0189 0.9828 1.0025 1.0045 1.0080 1.0061 0.9744 0.9915
dispersion: -0.026138503 hartree
energy: -1361.321481332155 hartree
dipole: -39.07843 35.42841 -3.65002 -5.44802 1.19609 -4.25192 -4.95473 3.03456 -1.92017
magnitude: 5.92356 au
magnitude: 15.05649 debye
