program: Orca
programVersion: 5.0.2
elementType: Cl O N N N C C C C C C C C C C C C C C C C C H H H H H H H H H H H H H H H H H H H H H H H
charge: 1
multiplicity: 1
keywords: wb97x-d3
keywords: def2-TZVPP
keywords: def2/J RIJCOSX
keywords: DEFGRID2
keywords: scfconv7
keywords: smallprint printgap noloewdin
keywords: NOSOSCF
formula: C17H23ClN3O
InChI: InChI=1/C17H23ClN3O/c1-16(2)8-7-14(9-13-3-5-15(18)6-4-13)17(16,22)10-21-12-19-11-20-21/h3-6,11-12,14,20,22H,7-10H2,1-2H3
45 atoms
Cl -4.446131 4.67978 -1.673804
O  1.089459 -1.103799 1.854645
N  1.590105 -3.416202 0.293998
N  1.815111 -3.760415 1.564909
N  2.996408 -5.093904 0.314541
C  1.167482 -0.965141 0.445874
C  2.570455 -0.457641 -0.006478
C  0.21843 0.145725 -0.054531
C  2.475718 1.043065 0.342309
C  0.998432 1.445878 0.202417
C  0.723374 -2.313798 -0.106342
C  -1.180094 0.1381 0.564083
C  2.767968 -0.619508 -1.516426
C  3.761499 -1.096557 0.704629
C  -2.021046 1.25862 0.018663
C  2.318324 -4.24069 -0.439251
C  -2.492239 1.224408 -1.292516
C  -2.322802 2.374022 0.79365
C  -3.235577 2.268392 -1.820182
C  -3.067677 3.429872 0.285717
C  2.672907 -4.762615 1.553313
C  -3.51666 3.366951 -1.022089
H  0.10056 0.010985 -1.133837
H  3.135866 1.627137 -0.300193
H  2.822128 1.214832 1.36539
H  0.644444 1.927616 1.116389
H  0.838974 2.16031 -0.604505
H  0.718844 -2.319904 -1.192978
H  -0.285941 -2.55494 0.229285
H  -1.110592 0.23756 1.648306
H  -1.676606 -0.814614 0.3600
H  1.974109 -0.16156 -2.107359
H  3.702237 -0.137536 -1.808278
H  2.844292 -1.665994 -1.816528
H  4.664071 -0.533399 0.458424
H  3.668185 -1.081185 1.790639
H  3.947693 -2.124525 0.390149
H  1.539311 -0.370818 2.291023
H  2.32067 -4.197646 -1.516567
H  -2.277239 0.367368 -1.919752
H  -1.973036 2.425371 1.817449
H  -3.591096 2.222586 -2.840624
H  -3.290958 4.286051 0.907824
H  3.030288 -5.223691 2.459492
H  1.424379 -3.219672 2.332384
elementType: Cl O N C H
totalener: -1361.29176964 hartree
nucrepener: 1974.76389143 hartree
electener: -3336.05566107 hartree
oneelecener: -5759.29052978 hartree
twoeener: 2423.23486872 hartree
cpcmener: -0.12030887 hartree
kineticenergy: 1356.44924535 hartree
xcener: -110.344929099229 hartree
chargesum: 1.0000000
charge: -0.107027 -0.465364 0.089797 -0.022443 -0.366139 0.363467 0.275413 -0.069614 -0.267636 -0.198731 -0.170712 -0.087604 -0.366081 -0.362658 0.009553 0.161762 -0.214395 -0.199583 -0.165620 -0.165578 0.192015 0.103245 0.104244 0.081508 0.099510 0.090974 0.093064 0.138618 0.165359 0.084201 0.103303 0.112371 0.102898 0.097824 0.113909 0.096602 0.093036 0.235830 0.193504 0.144930 0.142101 0.143062 0.143995 0.202551 0.250536
qa: -0.1070 -0.4654 0.0898 -0.0224 -0.3661 0.3635 0.2754 -0.0696 -0.2676 -0.1987 -0.1707 -0.0876 -0.3661 -0.3627 0.0096 0.1618 -0.2144 -0.1996 -0.1656 -0.1656 0.1920 0.1032 0.1042 0.0815 0.0995 0.0910 0.0931 0.1386 0.1654 0.0842 0.1033 0.1124 0.1029 0.0978 0.1139 0.0966 0.0930 0.2358 0.1935 0.1449 0.1421 0.1431 0.1440 0.2026 0.2505
va: 1.1976 1.9642 3.3908 3.4744 3.0302 3.8588 3.6838 3.8762 4.0021 3.9086 3.8594 3.7883 3.9585 3.9298 3.5486 3.9863 3.9726 3.9565 3.9974 4.0011 3.9462 3.8075 1.0122 1.0147 1.0022 1.0109 1.0052 0.9906 0.9919 1.0327 1.0137 0.9996 1.0047 0.9993 1.0030 1.0142 1.0018 1.0096 0.9831 1.0031 1.0054 1.0062 1.0055 0.9745 0.9909
dispersion: -0.026128214 hartree
energy: -1361.317897852686 hartree
dipole: 28.07879 -24.41764 3.66115 -13.50290 7.93496 -5.56794 4.94358 -3.02265 1.92093
magnitude: 6.93513 au
magnitude: 17.62769 debye
