program: Orca
programVersion: 5.0.2
elementType: Cl O N N N C C C C C C C C C C C C C C C C C H H H H H H H H H H H H H H H H H H H H H H H
charge: 1
multiplicity: 1
keywords: wb97x-d3
keywords: def2-TZVPP
keywords: def2/J RIJCOSX
keywords: DEFGRID2
keywords: scfconv7
keywords: smallprint printgap noloewdin
keywords: NOSOSCF
formula: C17H23ClN3O
InChI: InChI=1/C17H23ClN3O/c1-16(2)8-7-14(9-13-3-5-15(18)6-4-13)17(16,22)10-21-12-19-11-20-21/h3-6,11-12,14,20,22H,7-10H2,1-2H3
45 atoms
Cl -4.913867 2.622798 -1.836622
O  2.29736 -0.636605 1.995628
N  1.037692 -2.72924 0.526172
N  0.547106 -2.776582 1.768226
N  -0.871278 -3.800443 0.472862
C  2.276929 -0.583583 0.58207
C  3.518117 0.152534 -0.014289
C  1.028681 0.137527 -0.039416
C  2.990222 0.626389 -1.370211
C  1.58264 1.127037 -1.075011
C  2.282808 -2.057813 0.16857
C  0.080589 0.781486 0.976246
C  4.767081 -0.711973 -0.146002
C  3.866127 1.363226 0.859261
C  -1.172312 1.264991 0.303761
C  0.156627 -3.355555 -0.235327
C  -2.173167 0.356075 -0.034707
C  -1.356763 2.602459 -0.031154
C  -3.324868 0.761264 -0.690309
C  -2.502904 3.029165 -0.688846
C  -0.605676 -3.415835 1.710153
C  -3.477428 2.101293 -1.01433
H  0.442877 -0.607556 -0.586519
H  2.955294 -0.210401 -2.074897
H  3.633649 1.388518 -1.813559
H  1.616649 2.13835 -0.662016
H  0.957804 1.173705 -1.966803
H  3.100289 -2.603993 0.639054
H  2.369845 -2.170541 -0.909942
H  0.576243 1.618586 1.476332
H  -0.194921 0.060125 1.748716
H  5.600393 -0.104725 -0.504271
H  5.06786 -1.140733 0.81219
H  4.641818 -1.528704 -0.858464
H  4.596496 1.985463 0.339797
H  3.007937 1.998839 1.08775
H  4.3178 1.063508 1.806013
H  2.166475 0.245562 2.362332
H  0.299684 -3.473064 -1.297732
H  -2.052886 -0.691436 0.219612
H  -0.597235 3.331035 0.224368
H  -4.091893 0.041242 -0.941679
H  -2.62871 4.073666 -0.940233
H  -1.215924 -3.584306 2.582431
H  1.014414 -2.293147 2.532591
elementType: Cl O N C H
totalener: -1361.29114413 hartree
nucrepener: 2019.42511576 hartree
electener: -3380.71625988 hartree
oneelecener: -5847.74851738 hartree
twoeener: 2467.03225749 hartree
cpcmener: -0.12150234 hartree
kineticenergy: 1356.44154297 hartree
xcener: -110.342714988804 hartree
chargesum: 1.0000000
charge: -0.106365 -0.437441 0.084230 -0.028852 -0.370780 0.281653 0.271303 -0.067039 -0.228668 -0.202467 -0.124440 -0.074458 -0.346680 -0.387656 0.028074 0.163642 -0.221005 -0.223476 -0.166706 -0.150691 0.186068 0.096653 0.089818 0.088558 0.082336 0.088255 0.086720 0.155946 0.139579 0.103221 0.105024 0.104430 0.105214 0.093788 0.101330 0.108560 0.101800 0.245751 0.193415 0.146715 0.143568 0.141742 0.142885 0.202302 0.254145
qa: -0.1064 -0.4374 0.0842 -0.0289 -0.3708 0.2817 0.2713 -0.0670 -0.2287 -0.2025 -0.1244 -0.0745 -0.3467 -0.3877 0.0281 0.1636 -0.2210 -0.2235 -0.1667 -0.1507 0.1861 0.0967 0.0898 0.0886 0.0823 0.0883 0.0867 0.1559 0.1396 0.1032 0.1050 0.1044 0.1052 0.0938 0.1013 0.1086 0.1018 0.2458 0.1934 0.1467 0.1436 0.1417 0.1429 0.2023 0.2541
va: 1.1982 1.9814 3.4068 3.4593 3.0136 3.9504 3.7171 3.8238 4.0020 3.9654 3.8425 3.7333 3.9049 3.9469 3.5398 3.9865 3.9724 3.9809 4.0184 3.9862 3.9434 3.8071 1.0176 1.0089 1.0169 1.0024 1.0103 0.9925 0.9923 1.0113 1.0255 1.0022 1.0072 1.0010 1.0046 0.9978 1.0076 0.9970 0.9822 1.0029 1.0050 1.0075 1.0054 0.9742 0.9906
dispersion: -0.026718386 hartree
energy: -1361.317862512111 hartree
dipole: 39.78145 -36.26589 3.51555 -3.12677 -0.66408 -3.79085 5.58286 -3.28564 2.29722
magnitude: 5.65746 au
magnitude: 14.38012 debye
