program: Orca
programVersion: 5.0.2
elementType: Cl O N N N C C C C C C C C C C C C C C C C C H H H H H H H H H H H H H H H H H H H H H H H
charge: 1
multiplicity: 1
keywords: wb97x-d3
keywords: def2-TZVPP
keywords: def2/J RIJCOSX
keywords: DEFGRID2
keywords: scfconv7
keywords: smallprint printgap noloewdin
keywords: NOSOSCF
formula: C17H23ClN3O
InChI: InChI=1/C17H23ClN3O/c1-16(2)8-7-14(9-13-3-5-15(18)6-4-13)17(16,22)10-21-12-19-11-20-21/h3-6,11-12,14,19,22H,7-10H2,1-2H3
45 atoms
Cl -4.755362 3.287504 -1.309874
O  2.144185 -1.205391 1.821762
N  1.037892 -2.875345 -0.08146
N  -0.008458 -2.814366 -0.925951
N  -0.500046 -4.008465 0.825089
C  2.217344 -0.783668 0.477705
C  3.491256 0.073651 0.175481
C  1.006588 0.097639 -0.002606
C  3.02723 0.945901 -0.992839
C  1.61693 1.368032 -0.606113
C  2.251011 -2.100811 -0.306714
C  -0.061051 0.354144 1.063088
C  4.739663 -0.733946 -0.161596
C  3.818111 0.961754 1.382643
C  -1.239267 1.091772 0.492815
C  0.749498 -3.590965 0.981967
C  -1.40295 2.459746 0.687371
C  -2.190277 0.418075 -0.271757
C  -2.478979 3.144329 0.138631
C  -3.270793 1.082616 -0.829511
C  -0.939052 -3.510294 -0.355907
C  -3.404469 2.446528 -0.618705
H  0.512374 -0.429355 -0.822595
H  3.002773 0.35537 -1.914863
H  3.700106 1.787577 -1.168379
H  1.645584 2.17773 0.127799
H  1.038495 1.732961 -1.45526
H  3.08621 -2.726688 0.004508
H  2.327946 -1.933039 -1.378305
H  0.359087 0.935531 1.888826
H  -0.405615 -0.596002 1.480221
H  4.636672 -1.30154 -1.087656
H  5.589783 -0.0621 -0.293259
H  5.00076 -1.431276 0.637294
H  4.574542 1.694105 1.096135
H  2.960097 1.520764 1.762051
H  4.229426 0.383524 2.210977
H  2.029676 -0.442167 2.398672
H  1.401181 -3.826386 1.805611
H  -0.681775 3.007047 1.281983
H  -2.092101 -0.649501 -0.432905
H  -2.589645 4.207373 0.304859
H  -4.000361 0.541113 -1.416279
H  -1.923378 -3.687225 -0.754703
H  -1.016474 -4.598568 1.467612
elementType: Cl O N C H
totalener: -1361.30005791 hartree
nucrepener: 2015.80515705 hartree
electener: -3377.10521496 hartree
oneelecener: -5842.68336776 hartree
twoeener: 2465.57815280 hartree
cpcmener: -0.12039468 hartree
kineticenergy: 1356.44790990 hartree
xcener: -110.341656714224 hartree
chargesum: 1.0000000
charge: -0.106802 -0.435445 0.128312 -0.308072 -0.087200 0.301606 0.292612 -0.083729 -0.227804 -0.218968 -0.155206 -0.096075 -0.355339 -0.388827 0.010852 0.180853 -0.208456 -0.209266 -0.161415 -0.176747 0.149865 0.106670 0.101338 0.087630 0.081130 0.088086 0.086330 0.147542 0.147796 0.102366 0.109136 0.095176 0.104233 0.104145 0.099893 0.106876 0.101625 0.240863 0.212132 0.143012 0.158673 0.143166 0.140238 0.200625 0.246573
qa: -0.1068 -0.4354 0.1283 -0.3081 -0.0872 0.3016 0.2926 -0.0837 -0.2278 -0.2190 -0.1552 -0.0961 -0.3553 -0.3888 0.0109 0.1809 -0.2085 -0.2093 -0.1614 -0.1767 0.1499 0.1067 0.1013 0.0876 0.0811 0.0881 0.0863 0.1475 0.1478 0.1024 0.1091 0.0952 0.1042 0.1041 0.0999 0.1069 0.1016 0.2409 0.2121 0.1430 0.1587 0.1432 0.1402 0.2006 0.2466
va: 1.1978 2.0050 3.4436 2.8843 3.5588 3.9683 3.6779 3.7870 4.0012 3.9876 3.8234 3.7400 3.9078 3.9492 3.5479 3.9228 3.9711 3.9552 3.9983 4.0426 3.9310 3.7975 1.0248 1.0085 1.0168 1.0017 1.0104 0.9991 1.0039 1.0131 1.0193 0.9999 1.0020 1.0060 1.0049 0.9975 1.0080 1.0013 0.9826 1.0050 0.9921 1.0056 1.0093 0.9776 0.9654
dispersion: -0.026486258 hartree
energy: -1361.326544169624 hartree
dipole: 37.60997 -35.88308 1.72689 -7.79432 1.29321 -6.50112 7.10803 -5.01413 2.09390
magnitude: 7.04493 au
magnitude: 17.90679 debye
