program: Orca
programVersion: 5.0.2
elementType: Cl O N N N C C C C C C C C C C C C C C C C C H H H H H H H H H H H H H H H H H H H H H H H
charge: 1
multiplicity: 1
keywords: wb97x-d3
keywords: def2-TZVPP
keywords: def2/J RIJCOSX
keywords: DEFGRID2
keywords: scfconv7
keywords: smallprint printgap noloewdin
keywords: NOSOSCF
formula: C17H23ClN3O
InChI: InChI=1/C17H23ClN3O/c1-16(2)8-7-14(9-13-3-5-15(18)6-4-13)17(16,22)10-21-12-19-11-20-21/h3-6,11-12,14,19,22H,7-10H2,1-2H3
45 atoms
Cl -5.021113 1.193941 -0.713205
O  1.207837 0.149656 1.426877
N  0.226692 -2.008914 0.083825
N  0.783758 -3.206255 -0.165907
N  -0.674195 -3.353189 1.4417
C  1.675869 0.03813 0.100105
C  3.142338 -0.500462 0.063072
C  1.768621 1.419911 -0.620027
C  3.934368 0.786332 0.331981
C  3.246679 1.85825 -0.508075
C  0.618456 -0.801808 -0.62578
C  0.824754 2.504626 -0.084411
C  3.506431 -1.034033 -1.325051
C  3.471996 -1.564301 1.104819
C  -0.642532 2.210862 -0.226414
C  -0.65399 -2.085229 1.053414
C  -1.238153 2.188913 -1.486801
C  -1.440552 1.932718 0.879448
C  -2.579446 1.878097 -1.647567
C  -2.786042 1.622512 0.741115
C  0.221942 -4.016288 0.672514
C  -3.342441 1.589865 -0.526551
H  1.525399 1.262835 -1.675773
H  4.992871 0.666368 0.093854
H  3.887608 1.043216 1.395621
H  3.338783 2.847542 -0.057405
H  3.698321 1.924529 -1.498421
H  0.948346 -1.098216 -1.616911
H  -0.294167 -0.222861 -0.750587
H  1.053847 3.418207 -0.639679
H  1.061245 2.722514 0.959327
H  3.239952 -0.34952 -2.132293
H  4.583954 -1.197548 -1.383334
H  3.025032 -1.990162 -1.534562
H  3.273846 -1.228634 2.122687
H  2.931125 -2.496599 0.944553
H  4.536069 -1.803235 1.050095
H  1.801488 0.710792 1.938768
H  -1.265983 -1.287098 1.440518
H  -0.644459 2.411186 -2.365646
H  -1.011001 1.956756 1.872642
H  -3.021329 1.862144 -2.634711
H  -3.387479 1.408239 1.614268
H  0.422913 -5.070756 0.754735
H  -1.262108 -3.742872 2.169427
elementType: Cl O N C H
totalener: -1361.29695340 hartree
nucrepener: 2060.53070558 hartree
electener: -3421.82765897 hartree
oneelecener: -5931.71214796 hartree
twoeener: 2509.88448899 hartree
cpcmener: -0.11193407 hartree
kineticenergy: 1356.46055501 hartree
xcener: -110.345372320845 hartree
chargesum: 1.0000000
charge: -0.105911 -0.445244 0.176276 -0.335153 -0.093031 0.337678 0.275338 -0.072192 -0.262020 -0.144653 -0.232756 -0.128595 -0.379324 -0.344781 0.084582 0.180956 -0.245306 -0.263785 -0.131808 -0.137868 0.167814 0.083481 0.091322 0.081878 0.087568 0.074947 0.092682 0.153096 0.164510 0.108302 0.098808 0.110060 0.101864 0.095991 0.090190 0.099579 0.106883 0.228148 0.218600 0.140744 0.135089 0.144689 0.145676 0.200017 0.245657
qa: -0.1059 -0.4452 0.1763 -0.3352 -0.0930 0.3377 0.2753 -0.0722 -0.2620 -0.1447 -0.2328 -0.1286 -0.3793 -0.3448 0.0846 0.1810 -0.2453 -0.2638 -0.1318 -0.1379 0.1678 0.0835 0.0913 0.0819 0.0876 0.0749 0.0927 0.1531 0.1645 0.1083 0.0988 0.1101 0.1019 0.0960 0.0902 0.0996 0.1069 0.2281 0.2186 0.1407 0.1351 0.1447 0.1457 0.2000 0.2457
va: 1.1991 2.0011 3.4010 2.8701 3.5684 3.9027 3.6653 3.8947 3.9765 3.9002 3.8181 3.8445 3.9485 3.9127 3.4700 3.9334 3.9761 3.9929 3.9520 3.9507 3.9128 3.8217 1.0119 1.0186 1.0106 1.0159 1.0031 1.0036 1.0043 1.0041 1.0094 0.9960 1.0064 1.0105 1.0181 1.0091 1.0004 1.0154 0.9739 1.0065 1.0192 1.0042 1.0041 0.9770 0.9662
dispersion: -0.027767052 hartree
energy: -1361.324720450008 hartree
dipole: 38.34307 -37.56641 0.77666 -1.45473 -2.40802 -3.86275 1.59329 0.53720 2.13050
magnitude: 4.47918 au
magnitude: 11.38517 debye
