program: Orca
programVersion: 5.0.2
elementType: Cl O N N N C C C C C C C C C C C C C C C C C H H H H H H H H H H H H H H H H H H H H H H H
charge: 1
multiplicity: 1
keywords: wb97x-d3
keywords: def2-TZVPP
keywords: def2/J RIJCOSX
keywords: DEFGRID2
keywords: scfconv7
keywords: smallprint printgap noloewdin
keywords: NOSOSCF
formula: C17H23ClN3O
InChI: InChI=1/C17H23ClN3O/c1-16(2)8-7-14(9-13-3-5-15(18)6-4-13)17(16,22)10-21-12-19-11-20-21/h3-6,11-12,14,20,22H,7-10H2,1-2H3
45 atoms
Cl -4.710411 0.564963 -1.547313
O  2.54076 0.647818 1.67287
N  0.337683 1.548453 0.167004
N  0.367988 2.018406 1.419198
N  -1.485196 2.708623 0.509091
C  2.156272 -0.138928 0.536384
C  3.408235 -0.825216 -0.1350
C  1.326402 -1.295211 1.137437
C  3.470719 -2.217346 0.546493
C  2.442267 -2.198003 1.673458
C  1.448936 0.811806 -0.437836
C  0.415138 -2.076954 0.179333
C  4.700901 -0.038556 0.109668
C  3.262113 -0.979179 -1.653821
C  -0.852808 -1.392569 -0.254003
C  -0.798336 1.987354 -0.35988
C  -1.790142 -0.961163 0.68355
C  -1.157824 -1.229116 -1.60166
C  -2.977445 -0.364144 0.295032
C  -2.344682 -0.63581 -2.010542
C  -0.748919 2.707792 1.602456
C  -3.249006 -0.194128 -1.056725
H  0.708192 -0.919838 1.959212
H  4.474752 -2.444959 0.906059
H  3.224124 -2.998386 -0.175761
H  2.08076 -3.194452 1.927896
H  2.867121 -1.775692 2.584544
H  1.02331 0.286856 -1.288523
H  2.159305 1.550006 -0.82052
H  0.136737 -2.995302 0.703895
H  0.965158 -2.413986 -0.700409
H  4.651751 0.993789 -0.251388
H  5.021444 -0.040597 1.154681
H  5.516583 -0.507005 -0.440266
H  2.346601 -1.490214 -1.951961
H  3.307501 -0.026144 -2.184716
H  4.088334 -1.581392 -2.031368
H  3.430838 0.997828 1.557874
H  -1.098862 1.757431 -1.370341
H  -1.608469 -1.114848 1.741216
H  1.172469 1.74264 1.99786
H  -3.696596 -0.040961 1.03501
H  -2.571106 -0.533636 -3.06333
H  -0.992231 3.192115 2.535279
H  -0.471122 -1.595152 -2.35705
totalener: -1361.19379455 hartree
nucrepener: 2112.27364581 hartree
electener: -3473.46744035 hartree
oneelecener: -6034.17532422 hartree
twoeener: 2560.70788387 hartree
kineticenergy: 1356.48563936 hartree
xcener: -110.358282788882 hartree
chargesum: 1.0000000
charge: -0.021774 -0.404448 0.123742 -0.082206 -0.270627 0.364708 0.044083 0.106275 -0.163341 -0.213406 -0.312128 -0.288711 -0.367471 -0.335221 0.065158 0.097631 -0.182006 -0.155705 -0.171353 -0.247042 0.171465 0.145108 0.078414 0.094903 0.096935 0.096977 0.101861 0.160443 0.157233 0.129752 0.132168 0.106966 0.104093 0.123908 0.092360 0.103733 0.124602 0.223005 0.193050 0.130051 0.236806 0.134257 0.143252 0.186881 0.145619
qa: -0.0218 -0.4044 0.1237 -0.0822 -0.2706 0.3647 0.0441 0.1063 -0.1633 -0.2134 -0.3121 -0.2887 -0.3675 -0.3352 0.0652 0.0976 -0.1820 -0.1557 -0.1714 -0.2470 0.1715 0.1451 0.0784 0.0949 0.0969 0.0970 0.1019 0.1604 0.1572 0.1298 0.1322 0.1070 0.1041 0.1239 0.0924 0.1037 0.1246 0.2230 0.1930 0.1301 0.2368 0.1343 0.1433 0.1869 0.1456
va: 1.2884 2.0374 3.2989 3.4213 3.0367 3.6565 3.8377 3.7597 3.8773 4.0112 3.9849 3.8779 3.9609 3.9413 3.4297 4.0353 3.8727 3.8321 3.9712 4.0276 3.9704 3.8850 1.0262 1.0169 1.0088 1.0194 1.0243 0.9816 0.9994 1.0059 0.9890 1.0034 1.0000 1.0064 1.0093 0.9983 1.0062 1.0369 0.9809 1.0070 1.0399 1.0143 1.0125 0.9801 0.9986
dispersion: -0.029996796 hartree
energy: -1361.223791341739 hartree
dipole: 40.54305 -37.87567 2.66738 -12.82971 13.92946 1.09976 3.88316 -2.98831 0.89485
magnitude: 3.02079 au
magnitude: 7.67823 debye
