program: Orca
programVersion: 5.0.2
elementType: Cl O N N N C C C C C C C C C C C C C C C C C H H H H H H H H H H H H H H H H H H H H H H H
charge: 1
multiplicity: 1
keywords: wb97x-d3
keywords: def2-TZVPP
keywords: def2/J RIJCOSX
keywords: DEFGRID2
keywords: scfconv7
keywords: smallprint printgap noloewdin
keywords: NOSOSCF
formula: C17H23ClN3O
InChI: InChI=1/C17H23ClN3O/c1-16(2)8-7-14(9-13-3-5-15(18)6-4-13)17(16,22)10-21-12-19-11-20-21/h3-6,11-12,14,20,22H,7-10H2,1-2H3
45 atoms
Cl -4.798818 0.583408 -1.264746
O  2.567753 0.658436 1.625857
N  0.358361 1.528794 0.040936
N  0.282377 1.96747 1.299595
N  -1.460627 2.722275 0.245356
C  2.176274 -0.141288 0.508307
C  3.423125 -0.860844 -0.142059
C  1.339353 -1.271324 1.148336
C  3.465815 -2.238857 0.566582
C  2.445115 -2.178475 1.697685
C  1.489968 0.779927 -0.504191
C  0.410693 -2.059986 0.214301
C  4.718139 -0.082199 0.101532
C  3.292982 -1.051415 -1.657046
C  -0.882798 -1.386296 -0.156555
C  -0.709212 2.007642 -0.577932
C  -1.762266 -0.930795 0.825657
C  -1.260237 -1.241868 -1.488115
C  -2.966855 -0.332041 0.494934
C  -2.464501 -0.64718 -1.840565
C  -0.825499 2.677144 1.403879
C  -3.306379 -0.188203 -0.84214
H  0.733468 -0.868443 1.96544
H  4.469471 -2.476528 0.923215
H  3.193508 -3.028493 -0.137842
H  2.066764 -3.162804 1.977473
H  2.883883 -1.74179 2.596304
H  1.094097 0.241285 -1.360635
H  2.211268 1.511226 -0.876885
H  0.164537 -2.989046 0.737304
H  0.927754 -2.368099 -0.69519
H  5.538561 -0.576207 -0.420965
H  4.672297 0.938936 -0.289515
H  5.001938 -0.038769 1.154176
H  4.120471 -1.669186 -2.010006
H  2.373353 -1.557906 -1.951625
H  3.348886 -0.108553 -2.205057
H  3.283327 1.257337 1.373526
H  -0.903632 1.819231 -1.621842
H  -1.514458 -1.048946 1.874075
H  1.02556 1.716687 1.959105
H  -3.632603 0.016856 1.273245
H  -2.734379 -0.541527 -2.883077
H  -1.134983 3.139754 2.327432
H  -0.604311 -1.599273 -2.273461
elementType: Cl O N C H
totalener: -1361.28920395 hartree
nucrepener: 2114.48688125 hartree
electener: -3475.77608520 hartree
oneelecener: -6037.42012069 hartree
twoeener: 2561.64403548 hartree
cpcmener: -0.10125878 hartree
kineticenergy: 1356.43444331 hartree
xcener: -110.346341146589 hartree
chargesum: 1.0000000
charge: -0.094267 -0.433536 0.120158 -0.044127 -0.355481 0.382466 0.108018 0.077415 -0.169728 -0.212199 -0.249576 -0.203211 -0.366146 -0.368619 0.034537 0.122761 -0.214190 -0.154482 -0.200693 -0.216568 0.182353 0.169250 0.088617 0.081009 0.088053 0.083062 0.088788 0.158426 0.164564 0.112868 0.128974 0.105769 0.103711 0.106976 0.111628 0.103164 0.103298 0.235716 0.197535 0.141136 0.254088 0.140615 0.141529 0.198472 0.147869
qa: -0.0943 -0.4335 0.1202 -0.0441 -0.3555 0.3825 0.1080 0.0774 -0.1697 -0.2122 -0.2496 -0.2032 -0.3661 -0.3686 0.0345 0.1228 -0.2142 -0.1545 -0.2007 -0.2166 0.1824 0.1692 0.0886 0.0810 0.0881 0.0831 0.0888 0.1584 0.1646 0.1129 0.1290 0.1058 0.1037 0.1070 0.1116 0.1032 0.1033 0.2357 0.1975 0.1411 0.2541 0.1406 0.1415 0.1985 0.1479
va: 1.2118 2.0100 3.3339 3.4406 3.0175 3.7764 3.8581 3.8105 3.8966 3.9929 3.9228 3.8454 3.9491 3.9400 3.4865 4.0129 3.8892 3.8795 3.9810 4.0041 3.9621 3.7200 1.0216 1.0124 1.0040 1.0175 1.0242 0.9741 0.9943 1.0044 0.9909 1.0012 1.0022 1.0030 1.0022 1.0020 0.9978 1.0057 0.9774 1.0048 1.0090 1.0102 1.0091 0.9760 0.9988
dispersion: -0.030181526 hartree
energy: -1361.319385481085 hartree
dipole: 40.83274 -37.50527 3.32747 -12.75991 14.48330 1.72340 2.95919 -2.16224 0.79695
magnitude: 3.83109 au
magnitude: 9.73786 debye
