program: Orca
programVersion: 5.0.2
elementType: Cl O N N N C C C C C C C C C C C C C C C C C H H H H H H H H H H H H H H H H H H H H H H H
charge: 1
multiplicity: 1
keywords: wb97x-d3
keywords: def2-TZVPP
keywords: def2/J RIJCOSX
keywords: DEFGRID2
keywords: scfconv7
keywords: smallprint printgap noloewdin
keywords: NOSOSCF
formula: C17H23ClN3O
InChI: InChI=1/C17H23ClN3O/c1-16(2)8-7-14(9-13-3-5-15(18)6-4-13)17(16,22)10-21-12-19-11-20-21/h3-6,11-12,14,20,22H,7-10H2,1-2H3
45 atoms
Cl -4.955187 -4.444836 -0.344097
O  0.88225 1.643213 1.580292
N  2.15084 3.031444 -0.479556
N  2.091408 3.787052 0.619829
N  3.439913 4.772442 -0.769123
C  1.279772 0.859175 0.473014
C  2.602562 0.05388 0.683186
C  0.257591 -0.256888 0.152759
C  2.512612 -1.028656 -0.412073
C  1.021719 -1.222747 -0.751875
C  1.321397 1.847525 -0.698607
C  -1.104418 0.188083 -0.382008
C  2.603225 -0.599663 2.071306
C  3.897868 0.850703 0.558544
C  -2.088022 -0.949355 -0.38541
C  2.967563 3.660328 -1.30935
C  -2.314358 -1.702929 -1.533184
C  -2.773069 -1.300499 0.775691
C  -3.191549 -2.778022 -1.530751
C  -3.655644 -2.369323 0.798725
C  2.885878 4.823521 0.430472
C  -3.854569 -3.104807 -0.359362
H  0.067451 -0.755547 1.109978
H  2.984788 -1.953073 -0.076529
H  3.063026 -0.711567 -1.300519
H  0.834804 -0.985042 -1.802009
H  0.691019 -2.250696 -0.606367
H  0.319066 2.219148 -0.912848
H  1.706251 1.38463 -1.605149
H  -1.010697 0.576401 -1.39926
H  -1.492754 1.000304 0.23916
H  3.474631 -1.249733 2.160342
H  2.682524 0.135706 2.875499
H  1.728674 -1.222619 2.265558
H  4.061668 1.241111 -0.445887
H  3.956038 1.675798 1.272019
H  4.745115 0.195181 0.770628
H  0.784023 1.088237 2.363032
H  3.192974 3.278768 -2.29296
H  -1.801836 -1.448886 -2.453357
H  1.56872 3.452687 1.431491
H  -3.353947 -3.349332 -2.434995
H  -4.183384 -2.620146 1.709292
H  3.038763 5.583762 1.179537
H  -2.62384 -0.726409 1.682802
elementType: Cl O N C H
totalener: -1361.29335882 hartree
nucrepener: 1969.62812512 hartree
electener: -3330.92148394 hartree
oneelecener: -5749.01888845 hartree
twoeener: 2418.09740451 hartree
cpcmener: -0.10367803 hartree
kineticenergy: 1356.43575156 hartree
xcener: -110.343695616807 hartree
chargesum: 1.0000000
charge: -0.099988 -0.443789 0.078855 -0.041011 -0.360227 0.446191 0.251101 -0.089739 -0.241855 -0.212774 -0.222630 -0.067794 -0.377484 -0.365665 0.013738 0.170919 -0.223803 -0.228687 -0.151084 -0.154933 0.189033 0.093755 0.100414 0.085727 0.092788 0.090086 0.089944 0.168666 0.144180 0.087917 0.106348 0.101040 0.096941 0.119650 0.086102 0.102162 0.115313 0.235426 0.195759 0.140378 0.250849 0.142660 0.142753 0.201630 0.141136
qa: -0.1000 -0.4438 0.0789 -0.0410 -0.3602 0.4462 0.2511 -0.0897 -0.2419 -0.2128 -0.2226 -0.0678 -0.3775 -0.3657 0.0137 0.1709 -0.2238 -0.2287 -0.1511 -0.1549 0.1890 0.0938 0.1004 0.0857 0.0928 0.0901 0.0899 0.1687 0.1442 0.0879 0.1063 0.1010 0.0969 0.1197 0.0861 0.1022 0.1153 0.2354 0.1958 0.1404 0.2508 0.1427 0.1428 0.2016 0.1411
va: 1.2046 1.9667 3.4158 3.4445 3.0531 3.7516 3.7122 3.9289 3.9852 3.9368 3.9196 3.7465 3.9390 3.9293 3.5405 3.9774 3.9696 3.9942 3.9976 3.9893 3.9541 3.8357 1.0144 1.0111 1.0042 1.0062 1.0083 0.9849 0.9841 1.0098 1.0242 1.0050 1.0057 0.9956 1.0021 1.0053 1.0035 1.0098 0.9814 1.0052 1.0076 1.0060 1.0060 0.9744 1.0057
dispersion: -0.025603980 hartree
energy: -1361.318962799045 hartree
dipole: 29.68435 -25.64258 4.04177 10.37717 -5.45399 4.92318 4.54966 -3.89563 0.65403
magnitude: 6.40323 au
magnitude: 16.27573 debye
