program: Orca
programVersion: 5.0.2
elementType: Cl O N N N C C C C C C C C C C C C C C C C C H H H H H H H H H H H H H H H H H H H H H H H
charge: 1
multiplicity: 1
keywords: wb97x-d3
keywords: def2-TZVPP
keywords: def2/J RIJCOSX
keywords: DEFGRID2
keywords: scfconv7
keywords: smallprint printgap noloewdin
keywords: NOSOSCF
formula: C17H23ClN3O
InChI: InChI=1/C17H23ClN3O/c1-16(2)8-7-14(9-13-3-5-15(18)6-4-13)17(16,22)10-21-12-19-11-20-21/h3-6,11-12,14,20,22H,7-10H2,1-2H3
45 atoms
Cl -4.960759 0.640528 -0.91196
O  2.233479 0.370288 1.851253
N  0.384132 1.462086 0.080143
N  0.084286 1.718599 1.355253
N  -1.470815 2.61652 0.132642
C  2.187045 -0.245337 0.562553
C  3.636135 -0.637246 0.129911
C  1.407057 -1.595227 0.663163
C  3.83796 -1.933275 0.92395
C  2.510676 -2.674647 0.804709
C  1.628872 0.832298 -0.365144
C  0.446394 -1.985921 -0.466454
C  4.685793 0.412689 0.477123
C  3.724883 -0.927574 -1.371595
C  -0.882018 -1.282651 -0.550899
C  -0.572656 2.027241 -0.640488
C  -1.671911 -1.056315 0.575014
C  -1.392799 -0.907488 -1.79079
C  -2.923559 -0.468667 0.471645
C  -2.644586 -0.321574 -1.915438
C  -1.042223 2.404232 1.366165
C  -3.401676 -0.103568 -0.777162
H  0.825089 -1.555048 1.587779
H  4.071926 -1.707285 1.96898
H  4.679531 -2.514344 0.542782
H  2.517577 -3.313544 -0.081162
H  2.320547 -3.330362 1.654639
H  1.416842 0.432459 -1.353854
H  2.359953 1.634639 -0.480718
H  0.238034 -3.052027 -0.327122
H  0.947278 -1.919248 -1.434541
H  5.670039 0.060137 0.162498
H  4.512635 1.361394 -0.036257
H  4.744258 0.615821 1.545724
H  3.602124 -0.025043 -1.973455
H  4.712748 -1.328995 -1.60392
H  2.995825 -1.65813 -1.721354
H  2.440927 -0.284992 2.528627
H  -0.577418 1.996441 -1.718156
H  -1.321335 -1.346854 1.557936
H  0.705922 1.3486 2.08261
H  -3.518479 -0.301347 1.359839
H  -3.016493 -0.036025 -2.890545
H  -1.518064 2.726968 2.278192
H  -0.804734 -1.076024 -2.685414
elementType: Cl O N C H
totalener: -1361.28883873 hartree
nucrepener: 2109.48910660 hartree
electener: -3470.77794534 hartree
oneelecener: -6027.50513257 hartree
twoeener: 2556.72718723 hartree
cpcmener: -0.10008234 hartree
kineticenergy: 1356.44094890 hartree
xcener: -110.348822079727 hartree
chargesum: 1.0000000
charge: -0.094777 -0.439198 0.106825 -0.038792 -0.355117 0.444434 0.196557 -0.075726 -0.239377 -0.149493 -0.233140 -0.135525 -0.330972 -0.383553 0.059634 0.131916 -0.269310 -0.220161 -0.157964 -0.126982 0.179867 0.107535 0.094522 0.085758 0.085158 0.087772 0.083460 0.147597 0.169361 0.110320 0.114214 0.105978 0.094266 0.089754 0.101891 0.106448 0.111483 0.231266 0.200154 0.139614 0.248502 0.141549 0.140570 0.197901 0.135779
qa: -0.0948 -0.4392 0.1068 -0.0388 -0.3551 0.4444 0.1966 -0.0757 -0.2394 -0.1495 -0.2331 -0.1355 -0.3310 -0.3836 0.0596 0.1319 -0.2693 -0.2202 -0.1580 -0.1270 0.1799 0.1075 0.0945 0.0858 0.0852 0.0878 0.0835 0.1476 0.1694 0.1103 0.1142 0.1060 0.0943 0.0898 0.1019 0.1064 0.1115 0.2313 0.2002 0.1396 0.2485 0.1415 0.1406 0.1979 0.1358
va: 1.2108 2.0013 3.3550 3.4218 3.0218 3.6636 3.8274 3.9414 3.9689 3.9224 3.8716 3.8059 3.9303 3.9465 3.4795 3.9958 3.9224 3.9439 3.9503 3.9422 3.9633 3.7745 1.0276 1.0123 1.0188 1.0025 1.0143 0.9816 0.9922 0.9969 1.0011 1.0003 1.0044 1.0191 0.9981 1.0056 1.0011 1.0128 0.9772 1.0100 1.0219 1.0082 1.0070 0.9766 1.0057
dispersion: -0.029999792 hartree
energy: -1361.318838523619 hartree
dipole: 42.42735 -39.43311 2.99424 -12.94646 13.53515 0.58870 2.33069 -0.91720 1.41350
magnitude: 3.36304 au
magnitude: 8.54816 debye
