program: Orca
programVersion: 5.0.2
elementType: Cl O N N N C C C C C C C C C C C C C C C C C H H H H H H H H H H H H H H H H H H H H H H H
charge: 1
multiplicity: 1
keywords: wb97x-d3
keywords: def2-TZVPP
keywords: def2/J RIJCOSX
keywords: DEFGRID2
keywords: scfconv7
keywords: smallprint printgap noloewdin
keywords: NOSOSCF
formula: C17H23ClN3O
InChI: InChI=1/C17H23ClN3O/c1-16(2)8-7-14(9-13-3-5-15(18)6-4-13)17(16,22)10-21-12-19-11-20-21/h3-6,11-12,14,20,22H,7-10H2,1-2H3
45 atoms
Cl -5.549474 -2.181924 -0.177515
O  2.50257 1.110538 1.744406
N  1.580042 2.530361 -0.487323
N  1.305436 3.21688 0.625237
N  0.201214 4.147917 -0.997679
C  2.262126 0.377431 0.544821
C  3.218637 -0.870699 0.431355
C  0.829544 -0.206253 0.586311
C  2.335853 -2.057598 0.904656
C  1.036994 -1.459302 1.440942
C  2.523935 1.414323 -0.542905
C  0.218497 -0.556864 -0.781404
C  4.451973 -0.71852 1.321813
C  3.711501 -1.122236 -0.997034
C  -1.220706 -0.971813 -0.650992
C  0.902285 3.124151 -1.45759
C  -2.21036 -0.018256 -0.420105
C  -1.602868 -2.306746 -0.734897
C  -3.54034 -0.378594 -0.273179
C  -2.929488 -2.689051 -0.590478
C  0.464661 4.179503 0.297731
C  -3.888759 -1.718183 -0.358698
H  0.15942 0.508952 1.074397
H  2.847282 -2.666579 1.651891
H  2.118791 -2.72171 0.064764
H  0.19744 -2.153165 1.384286
H  1.130635 -1.197627 2.499083
H  2.423729 1.005515 -1.543933
H  3.531697 1.823265 -0.447046
H  0.781176 -1.355636 -1.267159
H  0.264759 0.301914 -1.454294
H  5.10728 -1.579332 1.176248
H  5.032613 0.1736 1.078248
H  4.210095 -0.683312 2.384474
H  2.901136 -1.20637 -1.722435
H  4.396965 -0.346176 -1.344395
H  4.260664 -2.064852 -1.026747
H  2.262011 0.588624 2.518615
H  0.946284 2.784244 -2.480474
H  -1.943555 1.031029 -0.35917
H  1.675052 2.891355 1.520456
H  -4.294072 0.377434 -0.097586
H  -3.205376 -3.732754 -0.661109
H  0.069069 4.875908 1.019798
H  -0.856889 -3.069712 -0.922513
elementType: Cl O N C H
totalener: -1361.29176149 hartree
nucrepener: 2010.44908632 hartree
electener: -3371.74084782 hartree
oneelecener: -5830.06825926 hartree
twoeener: 2458.32741145 hartree
cpcmener: -0.10567026 hartree
kineticenergy: 1356.42356377 hartree
xcener: -110.338801790370 hartree
chargesum: 1.0000000
charge: -0.098816 -0.443438 0.091213 -0.039116 -0.361280 0.409862 0.062766 0.045998 -0.144336 -0.252995 -0.178670 -0.132778 -0.328133 -0.381236 0.028028 0.157447 -0.238377 -0.241375 -0.152635 -0.137279 0.189977 0.093251 0.100790 0.081512 0.086081 0.096170 0.088146 0.147236 0.164463 0.118454 0.101114 0.103985 0.096333 0.094286 0.107134 0.102758 0.110922 0.232136 0.194154 0.144201 0.250820 0.140982 0.142854 0.201519 0.145872
qa: -0.0988 -0.4434 0.0912 -0.0391 -0.3613 0.4099 0.0628 0.0460 -0.1443 -0.2530 -0.1787 -0.1328 -0.3281 -0.3812 0.0280 0.1574 -0.2384 -0.2414 -0.1526 -0.1373 0.1900 0.0933 0.1008 0.0815 0.0861 0.0962 0.0881 0.1472 0.1645 0.1185 0.1011 0.1040 0.0963 0.0943 0.1071 0.1028 0.1109 0.2321 0.1942 0.1442 0.2508 0.1410 0.1429 0.2015 0.1459
va: 1.2056 1.9902 3.3860 3.4507 3.0260 3.7317 3.8734 3.9035 3.8592 4.0378 3.8614 3.7379 3.9608 3.9477 3.5368 3.9875 3.9983 3.9702 4.0067 3.9854 3.9472 3.8337 1.0217 1.0145 1.0053 1.0143 1.0137 0.9828 0.9941 1.0095 1.0215 1.0003 1.0075 1.0045 0.9981 0.9979 1.0014 1.0147 0.9817 1.0018 1.0065 1.0076 1.0057 0.9739 1.0029
dispersion: -0.026328113 hartree
energy: -1361.318089606195 hartree
dipole: 39.43781 -35.19764 4.24018 -3.06576 6.54311 3.47735 3.28875 -2.69513 0.59361
magnitude: 5.51575 au
magnitude: 14.01991 debye
