program: Orca
programVersion: 5.0.2
elementType: Cl O N N N C C C C C C C C C C C C C C C C C H H H H H H H H H H H H H H H H H H H H H H H
charge: 1
multiplicity: 1
keywords: wb97x-d3
keywords: def2-TZVPP
keywords: def2/J RIJCOSX
keywords: DEFGRID2
keywords: scfconv7
keywords: smallprint printgap noloewdin
keywords: NOSOSCF
formula: C17H23ClN3O
InChI: InChI=1/C17H23ClN3O/c1-16(2)8-7-14(9-13-3-5-15(18)6-4-13)17(16,22)10-21-12-19-11-20-21/h3-6,11-12,14,20,22H,7-10H2,1-2H3
45 atoms
Cl -5.5012 -2.361991 -0.286502
O  2.537459 0.903479 1.797818
N  1.560336 2.641919 -0.173344
N  1.343566 3.168541 1.034762
N  0.204028 4.341568 -0.39604
C  2.251899 0.352392 0.513669
C  3.204676 -0.861181 0.181598
C  0.822902 -0.239933 0.528231
C  2.338146 -2.10968 0.499546
C  1.068858 -1.603443 1.179215
C  2.477651 1.531479 -0.426646
C  0.156685 -0.379727 -0.851808
C  4.464795 -0.837327 1.047238
C  3.655236 -0.896334 -1.28189
C  -1.256445 -0.877466 -0.735079
C  0.86249 3.379816 -1.02268
C  -1.588774 -2.194414 -1.036495
C  -2.269522 -0.027872 -0.295244
C  -2.888923 -2.661045 -0.901384
C  -3.573893 -0.473657 -0.153442
C  0.51629 4.184949 0.879747
C  -3.872291 -1.793172 -0.457897
H  0.17291 0.390364 1.144054
H  2.878649 -2.827591 1.11866
H  2.081799 -2.633597 -0.424441
H  0.225604 -2.285517 1.065166
H  1.217335 -1.498015 2.258044
H  2.321102 1.269339 -1.468579
H  3.496004 1.911517 -0.324836
H  0.723136 -1.054749 -1.495323
H  0.138286 0.586731 -1.360096
H  4.254533 -0.95237 2.111039
H  5.111865 -1.668809 0.761225
H  5.041083 0.080657 0.913584
H  4.323137 -0.06973 -1.533739
H  4.212173 -1.817312 -1.462638
H  2.824528 -0.886598 -1.988796
H  2.298243 0.281775 2.49645
H  0.860144 3.184995 -2.083639
H  -0.822897 -2.87556 -1.387856
H  1.742379 2.714875 1.858934
H  -3.125268 -3.688996 -1.141798
H  -4.346967 0.202472 0.186597
H  0.163999 4.779587 1.707389
H  -2.042787 1.006386 -0.062055
elementType: Cl O N C H
totalener: -1361.29187566 hartree
nucrepener: 2007.50567239 hartree
electener: -3368.79754805 hartree
oneelecener: -5824.22722211 hartree
twoeener: 2455.42967406 hartree
cpcmener: -0.10581396 hartree
kineticenergy: 1356.42297781 hartree
xcener: -110.338808305202 hartree
chargesum: 1.0000000
charge: -0.098920 -0.445530 0.089235 -0.039988 -0.361456 0.414765 0.053016 0.041505 -0.138818 -0.251790 -0.180574 -0.124029 -0.328821 -0.380233 0.020190 0.160530 -0.239483 -0.235030 -0.137658 -0.153219 0.189125 0.094816 0.100703 0.081553 0.086484 0.096644 0.088044 0.147380 0.163894 0.118325 0.099559 0.094218 0.103873 0.096587 0.102949 0.111245 0.107352 0.233727 0.194324 0.145534 0.251297 0.142120 0.141487 0.202179 0.142885
qa: -0.0989 -0.4455 0.0892 -0.0400 -0.3615 0.4148 0.0530 0.0415 -0.1388 -0.2518 -0.1806 -0.1240 -0.3288 -0.3802 0.0202 0.1605 -0.2395 -0.2350 -0.1377 -0.1532 0.1891 0.0948 0.1007 0.0816 0.0865 0.0966 0.0880 0.1474 0.1639 0.1183 0.0996 0.0942 0.1039 0.0966 0.1029 0.1112 0.1074 0.2337 0.1943 0.1455 0.2513 0.1421 0.1415 0.2022 0.1429
va: 1.2054 1.9887 3.3882 3.4524 3.0304 3.7238 3.8910 3.9079 3.8524 4.0383 3.8636 3.7387 3.9618 3.9453 3.5500 3.9861 3.9687 4.0014 3.9891 4.0045 3.9486 3.8327 1.0214 1.0151 1.0054 1.0136 1.0139 0.9821 0.9940 1.0078 1.0227 1.0048 1.0006 1.0074 0.9976 1.0013 0.9986 1.0135 0.9816 1.0032 1.0057 1.0060 1.0073 0.9737 1.0027
dispersion: -0.026209957 hartree
energy: -1361.318085615290 hartree
dipole: 39.12478 -34.90818 4.21660 -2.30436 5.84615 3.54179 1.37294 -0.44025 0.93269
magnitude: 5.58515 au
magnitude: 14.19633 debye
