program: Gaussian 09
title: 000071044
version: EM64L-G09RevD.01
frameworkgroup: C1[X(C16H16N2O2)]
method: RPBEPBE
basis: SDD
operation: Freq
keyword: #p
keyword: freq=noraman
keyword: PBEPBE/SDD
title: #p freq=noraman PBEPBE/SDD
converged: YES YES NO NO
title: Mulliken charges:
elementType: O O N N C C C C C C C C C C C C C C C C H H H H H H H H H H H H H H H H
charge: -0.261768 -0.243908 -0.113146 -0.142815 0.130941 0.143566 0.292073 0.282460 -0.610100 -0.634747 -0.382397 -0.324317 -0.329335 -0.376476 -0.225436 -0.250299 -0.251075 -0.224075 -0.232246 -0.225894 0.272289 0.211046 0.274908 0.240731 0.261829 0.250097 0.264611 0.257752 0.278601 0.265366 0.231326 0.234111 0.236243 0.234006 0.231697 0.234379
chargesum: 0.00000
title: Mulliken charges with hydrogens summed into heavy atoms:
elementType: O O N N C C C C C C C C C C C C C C C C
charge: -0.261768 -0.243908 -0.113146 -0.142815 0.130941 0.143566 0.292073 0.282460 0.148144 0.117910 -0.117786 -0.066565 -0.050734 -0.111109 0.005891 -0.016188 -0.014833 0.009931 -0.000549 0.008485
polarizability: 2.31639489e+02 -5.76173179e+00 2.06787146e+02 2.20712663e+01 1.13795815e+01 1.25318703e+02
1716.lowfreq: -3.5362 -0.0005 -0.0004 0.0006 6.6131 11.1108 27.4646 40.4968 46.1396
frequency: 27.4587 40.4907 46.1210 62.1345 78.5856 91.0700 104.5244 138.1609 153.2721 168.5105 180.4779 208.1170 213.4451 243.7016 287.1902 306.0281 348.7957 363.3632 391.8117 406.5689 408.0392 437.9297 467.0918 506.6930 558.3469 613.0316 613.3016 626.4756 630.6406 678.8926 690.2421 701.8123 708.3104 711.5583 750.4542 788.6710 792.0667 860.6625 866.7390 885.9364 939.3661 943.8391 985.4821 988.5216 989.5123 989.8870 996.3030 1003.2033 1006.4929 1023.4658 1034.1224 1056.2929 1084.0300 1085.1707 1104.2902 1119.1220 1126.0260 1173.2128 1174.9939 1188.3731 1190.9975 1196.7863 1208.8653 1233.7088 1318.5247 1319.4521 1340.4137 1352.3247 1380.2704 1380.4393 1411.1319 1431.8481 1432.6500 1437.6109 1464.8620 1473.1389 1477.6799 1479.9489 1484.6480 1490.9510 1562.1985 1569.5279 1591.0516 1592.7385 1609.2667 1609.3905 2981.2941 2982.1920 3061.4423 3078.2196 3126.5190 3127.1208 3128.7152 3129.4335 3136.5620 3137.2781 3147.3448 3148.5159 3157.3414 3157.8745 3168.0299 3169.8005
redmass: 5.4670 4.6886 4.1761 5.4455 5.2632 4.2555 3.8638 2.0899 1.6113 1.5236 2.2483 4.8259 2.9833 3.5173 3.2562 6.5003 4.6035 5.7126 4.7483 2.8682 2.9656 4.1533 4.5781 4.7316 4.4239 6.4477 6.4119 6.7969 5.5453 5.2641 5.8125 5.2700 1.6249 1.6836 4.5721 2.2476 2.3466 1.2483 1.2489 3.8865 1.4252 1.4316 1.4017 2.0204 3.2834 3.9660 2.9744 1.3560 1.4505 2.4270 2.0445 1.7330 1.6191 1.6007 2.0653 1.4191 1.4316 1.0556 1.0561 1.2478 1.1173 2.3955 4.4182 4.8104 1.3342 1.3203 3.8821 3.6234 8.6522 8.3627 1.2781 1.7824 2.2151 1.3746 1.0539 1.1161 1.5800 1.9374 1.3207 1.1375 9.5085 8.1296 6.5617 6.8344 5.9989 5.9824 1.0358 1.0376 1.1025 1.0967 1.0954 1.0850 1.0877 1.1001 1.0884 1.0882 1.0927 1.0927 1.0965 1.0964 1.1015 1.1013
irintensity: 0.0104 1.8155 0.1459 1.8116 3.9577 1.0621 2.1073 0.1209 2.2873 1.4337 2.3412 3.0195 0.4442 1.0910 1.8390 10.8839 5.8000 7.1796 1.1114 0.7762 0.4619 0.1562 14.8370 13.5282 9.1989 0.7067 0.7959 18.4284 4.8734 12.5474 3.3610 3.5737 142.1100 35.9732 8.4309 14.7229 46.9273 0.3508 2.6286 1.3698 2.7033 12.3044 5.7043 9.5391 2.6615 3.2934 96.1344 3.6143 7.5122 16.1773 10.4647 14.8549 16.2162 4.0339 46.5403 12.7943 13.4752 0.3239 0.1463 34.0163 2.5022 52.7994 19.7605 22.0339 0.3823 1.0139 161.5242 142.8318 2.8011 0.4309 80.4786 17.0083 6.4062 20.5352 5.4225 12.4988 10.2220 5.4563 25.1503 18.1364 147.4216 175.3960 22.1784 55.1284 5.9366 4.3447 25.5311 62.3760 20.0418 14.4789 10.6863 0.1057 0.6693 0.5652 2.1786 6.9093 17.1684 10.9059 20.1684 14.3848 20.3452 19.8856
temp: 298.150 k
press: 1.00000 atm
elementType: 8 8 7 7 6 6 6 6 6 6 6 6 6 6 6 6 6 6 6 6 1 1 1 1 1 1 1 1 1 1 1 1 1 1 1 1
symmnumber: 1
zpe: 747944.4 jmol-1
zpe.correction: 0.284877 hartree
zpe.thermalcorrener: 0.303281 hartree
zpe.thermalcorrenthalpy: 0.304225 hartree
zpe.thermalcorrgfe: 0.237084 hartree
zpe.sumelectzpe: -877.808928 hartree
zpe.sumelectthermal: -877.790524 hartree
zpe.sumelectthermalent: -877.789580 hartree
zpe.sumelectthermalfe: -877.856721 hartree
dipole: -3.8743 2.7831 3.9915
dipole: 6.2199
quadrupole: -117.6453 -106.1275 -119.1256
quadrupole: 7.3087 2.7262 -3.9124
quadrupole: -3.3459 8.1720 -4.8261 7.3087 2.7262 -3.9124
hfenergy: -878.0938051 hartree
pointgroup: C01 [X(C16H16N2O2)]
dipole: 1.6454284 -1.1216779 1.4222384 debye
polarizability: 227.4967309|-6.0111429|207.1783112|-30.3141862|-9.3620659|129.0702963 unknown
InChI: InChI=1S/C16H16N2O2/c1-17(15(19)13-9-5-3-6-10-13)18(2)16(20)14-11-7-4-8-12-14/h3-12H,1-2H3
charge 0 multiplicity 1
36 atoms
O  -3.407882 1.945821 0.320592
O  0.871864 1.71742 -1.564298
N  -1.087696 1.932246 0.300712
N  0.105444 1.216153 0.577441
C  -2.330936 1.278189 0.251258
C  1.059202 1.133305 -0.452904
C  -2.338396 -0.221609 0.116465
C  2.286549 0.296698 -0.207278
C  -0.99415 3.404817 0.293602
C  0.319224 0.907233 2.008622
C  -3.275239 -0.950649 0.892649
C  2.22096 -0.996669 0.374508
C  -1.53231 -0.903629 -0.831461
C  3.526047 0.778131 -0.701157
C  -3.375538 -2.351804 0.755909
C  3.38709 -1.785673 0.480342
C  -1.648769 -2.303384 -0.979272
C  4.693042 -0.004337 -0.576968
C  -2.559515 -3.032351 -0.178565
C  4.626869 -1.287692 0.016461
H  -0.326872 3.721609 -0.524611
H  -0.611596 3.782774 1.261085
H  -2.008927 3.798585 0.132892
H  0.06604 1.796839 2.614307
H  1.372509 0.648047 2.186617
H  -0.321368 0.065427 2.32905
H  -3.927141 -0.405886 1.583837
H  1.257963 -1.399065 0.709126
H  -0.853483 -0.339623 -1.479592
H  3.554716 1.756906 -1.191053
H  -4.095547 -2.909443 1.364834
H  3.326765 -2.788821 0.916268
H  -1.036965 -2.821207 -1.726186
H  5.648954 0.37883 -0.950029
H  -2.644768 -4.118761 -0.293838
H  5.53166 -1.899228 0.104739
