program: Orca
programVersion: 5.0.2
elementType: Cl O N N N C C C C C C C C C C C C C C C C C H H H H H H H H H H H H H H H H H H H H H H H
charge: 1
multiplicity: 1
keywords: wb97x-d3
keywords: def2-TZVPP
keywords: def2/J RIJCOSX
keywords: DEFGRID2
keywords: scfconv7
keywords: smallprint printgap noloewdin
keywords: NOSOSCF
formula: C17H23ClN3O
InChI: InChI=1/C17H23ClN3O/c1-16(2)8-7-14(9-13-3-5-15(18)6-4-13)17(16,22)10-21-12-19-11-20-21/h3-6,11-12,14,20,22H,7-10H2,1-2H3
45 atoms
Cl 5.035787 -0.575392 -0.749816
O  -2.174699 -0.041673 1.936245
N  -0.41316 -1.471931 0.223455
N  -0.030375 -1.504019 1.502549
N  1.471802 -2.575095 0.348897
C  -2.208758 0.276097 0.543076
C  -3.675525 0.606471 0.126932
C  -1.433643 1.622694 0.42085
C  -3.842742 2.003767 0.732393
C  -2.533577 2.711704 0.412996
C  -1.679861 -0.920338 -0.255326
C  -0.493263 1.823497 -0.772005
C  -4.713675 -0.376215 0.663202
C  -3.826675 0.669783 -1.395669
C  0.861545 1.16665 -0.730951
C  0.514902 -2.129037 -0.451787
C  1.646437 1.166846 0.421086
C  1.403038 0.61082 -1.88744
C  2.925952 0.632437 0.423695
C  2.683174 0.076323 -1.907137
C  1.113932 -2.155846 1.55198
C  3.437149 0.093944 -0.745902
H  -0.844392 1.728196 1.334079
H  -3.992366 1.929067 1.812026
H  -4.714323 2.519148 0.324945
H  -2.590708 3.172657 -0.575818
H  -2.304974 3.513776 1.114861
H  -1.510461 -0.667635 -1.299716
H  -2.408011 -1.733023 -0.226285
H  -0.319823 2.902477 -0.840169
H  -0.993731 1.558405 -1.705975
H  -4.787721 -0.371048 1.752402
H  -5.700394 -0.098017 0.289731
H  -4.53019 -1.402021 0.335677
H  -3.755037 -0.31751 -1.855496
H  -4.813804 1.064945 -1.640781
H  -3.094389 1.313618 -1.881844
H  -2.828054 -0.727632 2.128844
H  0.45505 -2.282542 -1.5171
H  1.268353 1.596823 1.340197
H  0.814054 0.590427 -2.796541
H  3.515605 0.643244 1.330619
H  3.07998 -0.35242 -2.817477
H  1.653911 -2.311521 2.471569
H  -0.594504 -1.001264 2.19471
elementType: Cl O N C H
totalener: -1361.28596283 hartree
nucrepener: 2108.26812707 hartree
electener: -3469.55408989 hartree
oneelecener: -6024.87087855 hartree
twoeener: 2555.31678865 hartree
cpcmener: -0.11691879 hartree
kineticenergy: 1356.45517077 hartree
xcener: -110.351104707996 hartree
chargesum: 1.0000000
charge: -0.103076 -0.438770 0.106085 -0.035092 -0.366407 0.376899 0.205911 -0.044984 -0.225401 -0.165155 -0.202582 -0.109503 -0.347245 -0.384954 0.054941 0.135257 -0.284037 -0.233180 -0.139327 -0.110500 0.176925 0.084247 0.089819 0.082503 0.086358 0.085722 0.081465 0.147803 0.165993 0.108432 0.113435 0.092508 0.103671 0.112873 0.103809 0.104458 0.111102 0.239026 0.202307 0.142703 0.138429 0.143177 0.139757 0.199385 0.255210
qa: -0.1031 -0.4388 0.1061 -0.0351 -0.3664 0.3769 0.2059 -0.0450 -0.2254 -0.1652 -0.2026 -0.1095 -0.3472 -0.3850 0.0549 0.1353 -0.2840 -0.2332 -0.1393 -0.1105 0.1769 0.0842 0.0898 0.0825 0.0864 0.0857 0.0815 0.1478 0.1660 0.1084 0.1134 0.0925 0.1037 0.1129 0.1038 0.1045 0.1111 0.2390 0.2023 0.1427 0.1384 0.1432 0.1398 0.1994 0.2552
va: 1.2025 2.0257 3.3656 3.4373 3.0184 3.8097 3.8328 3.8413 3.9445 3.9439 3.8829 3.7975 3.9209 3.9509 3.5141 3.9953 3.9444 3.9445 3.9230 3.9320 3.9681 3.7809 1.0360 1.0262 1.0178 1.0024 1.0133 0.9814 0.9929 0.9968 1.0038 1.0092 1.0009 1.0012 0.9976 1.0049 1.0002 1.0044 0.9769 1.0096 1.0053 1.0066 1.0071 0.9767 1.0097
dispersion: -0.029953496 hartree
energy: -1361.315916320999 hartree
dipole: -43.42551 39.90256 -3.52295 10.85904 -12.51070 -1.65166 0.45909 0.62810 1.08719
magnitude: 4.03994 au
magnitude: 10.26871 debye
