program: Orca
programVersion: 5.0.2
elementType: Cl O N N N C C C C C C C C C C C C C C C C C H H H H H H H H H H H H H H H H H H H H H H H
charge: 1
multiplicity: 1
keywords: wb97x-d3
keywords: def2-TZVPP
keywords: def2/J RIJCOSX
keywords: DEFGRID2
keywords: scfconv7
keywords: smallprint printgap noloewdin
keywords: NOSOSCF
formula: C17H23ClN3O
InChI: InChI=1/C17H23ClN3O/c1-16(2)8-7-14(9-13-3-5-15(18)6-4-13)17(16,22)10-21-12-19-11-20-21/h3-6,11-12,14,20,22H,7-10H2,1-2H3
45 atoms
Cl 4.80726 -0.661114 -1.18502
O  -2.576638 -0.555316 1.655964
N  -0.319152 -1.514862 0.31187
N  -0.217277 -1.719514 1.627517
N  1.538763 -2.60498 0.696269
C  -2.182497 0.16188 0.484633
C  -3.440463 0.724793 -0.288012
C  -1.379013 1.410355 0.924143
C  -3.530533 2.202513 0.175773
C  -2.511574 2.373062 1.299204
C  -1.466936 -0.893269 -0.351073
C  -0.465394 2.056516 -0.126706
C  -4.710524 -0.044982 0.076941
C  -3.297142 0.663817 -1.812516
C  0.839971 1.356461 -0.389732
C  0.759293 -2.059564 -0.226432
C  1.724166 1.073734 0.651197
C  1.221632 1.013528 -1.683232
C  2.943379 0.460363 0.415044
C  2.43968 0.398479 -1.941255
C  0.912438 -2.366823 1.836711
C  3.290465 0.12362 -0.884568
H  -0.770232 1.168024 1.799982
H  -4.541783 2.462062 0.492575
H  -3.283614 2.870387 -0.652645
H  -2.158381 3.400183 1.398244
H  -2.945858 2.110426 2.267789
H  -1.076898 -0.485033 -1.278599
H  -2.167666 -1.691131 -0.603592
H  -0.236707 3.060884 0.24132
H  -0.988945 2.204652 -1.071647
H  -5.543403 0.344165 -0.51116
H  -4.624746 -1.109698 -0.148719
H  -4.98853 0.059624 1.125804
H  -4.144947 1.177866 -2.268278
H  -2.394395 1.152751 -2.179624
H  -3.305125 -0.35988 -2.191268
H  -3.016721 0.034452 2.280399
H  0.934576 -2.059384 -1.290153
H  1.467196 1.338978 1.669566
H  0.556109 1.225707 -2.511583
H  3.613245 0.2476 1.237158
H  2.712626 0.135445 -2.954441
H  1.241988 -2.650908 2.822742
H  -0.965008 -1.382315 2.240341
elementType: Cl O N C H
totalener: -1361.28481307 hartree
nucrepener: 2115.52182443 hartree
electener: -3476.80663749 hartree
oneelecener: -6039.24684075 hartree
twoeener: 2562.44020325 hartree
cpcmener: -0.11251182 hartree
kineticenergy: 1356.44411965 hartree
xcener: -110.348253507803 hartree
chargesum: 1.0000000
charge: -0.102848 -0.448205 0.116085 -0.038249 -0.365893 0.433776 0.075100 0.056496 -0.158222 -0.212073 -0.240367 -0.197063 -0.342198 -0.373388 0.025594 0.120574 -0.213974 -0.149343 -0.203631 -0.215046 0.185493 0.170651 0.094793 0.078716 0.086959 0.081184 0.088081 0.165045 0.165601 0.109278 0.130029 0.103186 0.097038 0.096860 0.108518 0.105233 0.103114 0.234970 0.202435 0.142492 0.149610 0.140857 0.140920 0.198803 0.253009
qa: -0.1028 -0.4482 0.1161 -0.0382 -0.3659 0.4338 0.0751 0.0565 -0.1582 -0.2121 -0.2404 -0.1971 -0.3422 -0.3734 0.0256 0.1206 -0.2140 -0.1493 -0.2036 -0.2150 0.1855 0.1707 0.0948 0.0787 0.0870 0.0812 0.0881 0.1650 0.1656 0.1093 0.1300 0.1032 0.0970 0.0969 0.1085 0.1052 0.1031 0.2350 0.2024 0.1425 0.1496 0.1409 0.1409 0.1988 0.2530
va: 1.2027 1.9856 3.3424 3.4348 3.0137 3.6622 3.8899 3.9244 3.8859 4.0110 3.9103 3.8425 3.9633 3.9379 3.4954 4.0096 3.8860 3.8825 3.9817 4.0075 3.9618 3.6968 1.0174 1.0139 1.0041 1.0161 1.0117 0.9736 0.9973 1.0043 0.9887 0.9996 1.0070 1.0034 1.0016 1.0009 0.9976 1.0116 0.9756 1.0051 0.9980 1.0103 1.0090 0.9761 1.0106
dispersion: -0.030257110 hartree
energy: -1361.315070176015 hartree
dipole: -40.84732 37.74483 -3.10249 13.08055 -13.73875 -0.65820 1.59873 0.19727 1.79600
magnitude: 3.64476 au
magnitude: 9.26425 debye
