program: Orca
programVersion: 5.0.2
elementType: Cl O N N N C C C C C C C C C C C C C C C C C H H H H H H H H H H H H H H H H H H H H H H H
charge: 1
multiplicity: 1
keywords: wb97x-d3
keywords: def2-TZVPP
keywords: def2/J RIJCOSX
keywords: DEFGRID2
keywords: scfconv7
keywords: smallprint printgap noloewdin
keywords: NOSOSCF
formula: C17H23ClN3O
InChI: InChI=1/C17H23ClN3O/c1-16(2)8-7-14(9-13-3-5-15(18)6-4-13)17(16,22)10-21-12-19-11-20-21/h3-6,11-12,14,19,22H,7-10H2,1-2H3
45 atoms
Cl -5.036892 -0.871343 0.719216
O  1.516257 -0.301325 1.623441
N  0.431381 1.725973 0.06727
N  -0.0728 2.452516 -0.943803
N  -1.606642 2.043924 0.542504
C  2.17475 -0.070145 0.397421
C  3.728987 -0.24808 0.504979
C  1.782933 -1.068997 -0.730813
C  4.141153 -0.349283 -0.963207
C  3.026896 -1.147293 -1.648781
C  1.858727 1.392947 0.075385
C  0.535296 -0.835777 -1.585885
C  4.048861 -1.568577 1.221279
C  4.452904 0.871414 1.247782
C  -0.836874 -0.871526 -0.961512
C  -0.488092 1.466582 0.971159
C  -1.128009 -1.498039 0.247534
C  -1.898579 -0.298187 -1.661665
C  -2.414411 -1.505318 0.768058
C  -3.191496 -0.305882 -1.164297
C  -1.317785 2.629418 -0.649274
C  -3.442775 -0.893829 0.067153
H  1.661216 -2.041379 -0.241779
H  5.122924 -0.80889 -1.079982
H  4.226258 0.648959 -1.401831
H  2.811594 -0.744411 -2.639851
H  3.315478 -2.18668 -1.804507
H  2.225823 1.678846 -0.907501
H  2.323302 2.04777 0.811292
H  0.555212 -1.613704 -2.357135
H  0.645262 0.097205 -2.14851
H  3.55026 -2.439481 0.792399
H  5.118993 -1.762813 1.152811
H  3.82371 -1.530419 2.29007
H  4.028346 1.043444 2.239033
H  5.499978 0.60442 1.392656
H  4.452892 1.816714 0.703341
H  1.798331 -1.147366 1.984217
H  -0.355376 0.911054 1.88203
H  -0.350037 -1.998463 0.805658
H  -1.714049 0.155199 -2.629015
H  -2.618971 -2.000445 1.707795
H  -4.001043 0.129953 -1.734757
H  -2.028549 3.169418 -1.251612
H  -2.512513 1.968894 0.983518
totalener: -1361.20353131 hartree
nucrepener: 2110.64257335 hartree
electener: -3471.84610466 hartree
oneelecener: -6031.40911438 hartree
twoeener: 2559.56300972 hartree
kineticenergy: 1356.49317801 hartree
xcener: -110.359753599746 hartree
chargesum: 1.0000000
charge: -0.028491 -0.397401 0.151103 -0.240820 -0.105715 0.419201 0.219828 -0.042908 -0.259535 -0.183845 -0.289119 -0.235495 -0.387316 -0.323220 0.136747 0.120955 -0.211083 -0.240977 -0.108535 -0.144382 0.126817 0.001141 0.085879 0.099845 0.093218 0.093222 0.108694 0.154408 0.160937 0.135832 0.093478 0.121972 0.111214 0.097527 0.107266 0.115197 0.087105 0.201059 0.218736 0.106129 0.138797 0.143870 0.145553 0.186909 0.216205
qa: -0.0285 -0.3974 0.1511 -0.2408 -0.1057 0.4192 0.2198 -0.0429 -0.2595 -0.1838 -0.2891 -0.2355 -0.3873 -0.3232 0.1367 0.1210 -0.2111 -0.2410 -0.1085 -0.1444 0.1268 0.0011 0.0859 0.0998 0.0932 0.0932 0.1087 0.1544 0.1609 0.1358 0.0935 0.1220 0.1112 0.0975 0.1073 0.1152 0.0871 0.2011 0.2187 0.1061 0.1388 0.1439 0.1456 0.1869 0.2162
va: 1.2784 2.0154 3.4271 2.8497 3.5332 3.7085 3.6813 3.8114 3.9684 3.8856 3.8740 3.8827 3.9523 3.9112 3.3961 3.9491 3.9371 3.9021 3.9457 3.9240 3.9512 3.9371 1.0104 1.0229 1.0110 1.0137 1.0106 1.0006 0.9923 0.9939 1.0061 0.9922 1.0105 1.0055 1.0105 1.0072 0.9986 1.0508 0.9992 1.0409 1.0074 1.0074 1.0087 0.9847 0.9879
dispersion: -0.030176369 hartree
energy: -1361.233707680779 hartree
dipole: 42.12063 -41.57611 0.54452 -2.28735 3.85933 1.57198 -2.23629 2.75573 0.51944
magnitude: 1.74282 au
magnitude: 4.42990 debye
