program: Orca
programVersion: 5.0.2
elementType: Cl O N N N C C C C C C C C C C C C C C C C C H H H H H H H H H H H H H H H H H H H H H H H
charge: 1
multiplicity: 1
keywords: wb97x-d3
keywords: def2-TZVPP
keywords: def2/J RIJCOSX
keywords: DEFGRID2
keywords: scfconv7
keywords: smallprint printgap noloewdin
keywords: NOSOSCF
formula: C17H23ClN3O
InChI: InChI=1/C17H23ClN3O/c1-16(2)8-7-14(9-13-3-5-15(18)6-4-13)17(16,22)10-21-12-19-11-20-21/h3-6,11-12,14,19,22H,7-10H2,1-2H3
45 atoms
Cl -4.96859 -0.133407 -0.042416
O  2.049532 -0.123713 1.813579
N  0.181636 1.471004 0.522099
N  -0.454755 2.600207 0.169376
N  -1.681713 1.420088 1.518938
C  2.198613 -0.053707 0.407335
C  3.708291 0.006459 0.013021
C  1.697903 -1.439206 -0.127192
C  4.125288 -1.454395 0.207836
C  2.984631 -2.249457 -0.406541
C  1.476903 1.20018 -0.100329
C  0.754273 -1.487763 -1.340109
C  4.536148 0.95755 0.874674
C  3.881941 0.416106 -1.45503
C  -0.68955 -1.165743 -1.062488
C  -0.549003 0.745555 1.336577
C  -1.422602 -1.942145 -0.164552
C  -1.344548 -0.114549 -1.69624
C  -2.742022 -1.647987 0.138299
C  -2.666638 0.194237 -1.408974
C  -1.591005 2.557195 0.77979
C  -3.353675 -0.56217 -0.473085
H  1.177609 -1.911583 0.710435
H  4.224126 -1.679801 1.272082
H  5.089922 -1.669735 -0.25387
H  3.135072 -2.354945 -1.48363
H  2.912987 -3.260884 -0.007812
H  1.299131 1.162066 -1.173914
H  2.078034 2.091293 0.08985
H  0.800148 -2.510343 -1.726043
H  1.129574 -0.862978 -2.155151
H  4.1770 1.989717 0.844482
H  4.609788 0.643925 1.918693
H  5.562261 0.982216 0.507777
H  4.919613 0.267676 -1.754335
H  3.270124 -0.163931 -2.146102
H  3.661299 1.472118 -1.621715
H  2.658813 0.485884 2.242858
H  -0.28605 -0.191538 1.791801
H  -0.960959 -2.802365 0.306955
H  -0.821642 0.479436 -2.437121
H  -3.296255 -2.266878 0.831357
H  -3.158645 1.013207 -1.916414
H  -2.359266 3.309959 0.721959
H  -2.474738 1.104949 2.059506
totalener: -1361.20390546 hartree
nucrepener: 2115.86129254 hartree
electener: -3477.06519800 hartree
oneelecener: -6041.61295670 hartree
twoeener: 2564.54775871 hartree
kineticenergy: 1356.49583116 hartree
xcener: -110.356636061339 hartree
chargesum: 1.0000000
charge: -0.033396 -0.385793 0.188120 -0.251882 -0.099588 0.390779 0.179037 -0.106356 -0.200173 -0.172844 -0.300070 -0.202878 -0.336378 -0.364407 0.128406 0.097136 -0.285201 -0.185754 -0.081854 -0.130553 0.135488 -0.020718 0.099317 0.092570 0.099509 0.096261 0.096154 0.148172 0.149797 0.130146 0.115140 0.109708 0.088351 0.116666 0.114203 0.106304 0.102333 0.198897 0.215328 0.137257 0.134439 0.147117 0.144564 0.187766 0.208879
qa: -0.0334 -0.3858 0.1881 -0.2519 -0.0996 0.3908 0.1790 -0.1064 -0.2002 -0.1728 -0.3001 -0.2029 -0.3364 -0.3644 0.1284 0.0971 -0.2852 -0.1858 -0.0819 -0.1306 0.1355 -0.0207 0.0993 0.0926 0.0995 0.0963 0.0962 0.1482 0.1498 0.1301 0.1151 0.1097 0.0884 0.1167 0.1142 0.1063 0.1023 0.1989 0.2153 0.1373 0.1344 0.1471 0.1446 0.1878 0.2089
va: 1.2793 2.0577 3.3571 2.8647 3.5438 3.6582 3.8280 3.7356 3.9382 3.9568 3.9018 3.8201 3.9281 3.9492 3.3367 4.0037 3.9572 3.9272 3.8771 3.8482 3.9380 3.9266 1.0333 1.0281 1.0208 1.0041 1.0168 0.9958 1.0177 1.0043 1.0117 1.0014 1.0115 1.0068 1.0109 1.0040 0.9977 1.0522 0.9878 1.0080 1.0081 1.0059 1.0084 0.9835 0.9944
dispersion: -0.030380292 hartree
energy: -1361.234285748836 hartree
dipole: 41.78519 -41.38864 0.39655 -3.73106 4.93773 1.20666 -3.15532 4.42841 1.27309
magnitude: 1.79835 au
magnitude: 4.57103 debye
