program: Orca
programVersion: 5.0.2
elementType: Cl O N N N C C C C C C C C C C C C C C C C C H H H H H H H H H H H H H H H H H H H H H H H
charge: 1
multiplicity: 1
keywords: wb97x-d3
keywords: def2-TZVPP
keywords: def2/J RIJCOSX
keywords: DEFGRID2
keywords: scfconv7
keywords: smallprint printgap noloewdin
keywords: NOSOSCF
formula: C17H23ClN3O
InChI: InChI=1/C17H23ClN3O/c1-16(2)8-7-14(9-13-3-5-15(18)6-4-13)17(16,22)10-21-12-19-11-20-21/h3-6,11-12,14,19,22H,7-10H2,1-2H3
45 atoms
Cl -5.350528 -1.472047 -0.214559
O  1.539459 -0.246394 1.79559
N  0.602027 2.108329 0.664547
N  0.966506 3.212789 -0.006331
N  0.519544 3.686113 2.065274
C  1.667022 -0.132684 0.388936
C  3.107411 0.32312 -0.008177
C  1.499122 -1.55028 -0.270207
C  3.860065 -1.015648 0.030795
C  2.923379 -1.997531 -0.654921
C  0.527571 0.810174 0.005534
C  0.54388 -1.715623 -1.461018
C  3.756948 1.332632 0.934185
C  3.145954 0.88366 -1.433297
C  -0.930019 -1.660256 -1.152928
C  0.325553 2.382033 1.918633
C  -1.486886 -2.45343 -0.151096
C  -1.781199 -0.826944 -1.873318
C  -2.840691 -2.404675 0.140837
C  -3.139824 -0.764257 -1.598177
C  0.914259 4.169418 0.862932
C  -3.658561 -1.552009 -0.58426
H  1.131757 -2.1985 0.529047
H  4.048438 -1.317321 1.067491
H  4.838501 -0.94732 -0.448442
H  3.055621 -1.948186 -1.738409
H  3.107773 -3.033325 -0.367945
H  -0.423741 0.371864 0.30054
H  0.490364 1.0087 -1.061261
H  0.760685 -2.698427 -1.892485
H  0.783203 -0.995346 -2.2472
H  3.740431 1.011286 1.975512
H  4.806005 1.458377 0.658222
H  3.305236 2.32361 0.880414
H  4.182978 1.000522 -1.754344
H  2.656412 0.241362 -2.166295
H  2.679029 1.86689 -1.499851
H  2.240334 -0.808529 2.144984
H  -0.012412 1.6958 2.676498
H  -0.860598 -3.129189 0.418853
H  -1.379001 -0.202323 -2.662355
H  -3.250237 -3.027235 0.925288
H  -3.78076 -0.103673 -2.16703
H  1.145143 5.203787 0.671411
H  0.388694 4.214399 2.920584
elementType: Cl O N C H
totalener: -1361.30059494 hartree
nucrepener: 2032.66094352 hartree
electener: -3393.96153846 hartree
oneelecener: -5876.45333383 hartree
twoeener: 2482.49179537 hartree
cpcmener: -0.10110979 hartree
kineticenergy: 1356.44703168 hartree
xcener: -110.341941738323 hartree
chargesum: 1.0000000
charge: -0.099949 -0.428702 0.142018 -0.308058 -0.091717 0.399447 0.194271 -0.086057 -0.248237 -0.145378 -0.218682 -0.122696 -0.340165 -0.387045 0.003374 0.191665 -0.232152 -0.184798 -0.147575 -0.148066 0.154789 0.093824 0.081516 0.084893 0.082131 0.085999 0.084058 0.168117 0.151410 0.112366 0.108710 0.092387 0.110312 0.093862 0.104925 0.110087 0.102073 0.222343 0.208022 0.140002 0.140478 0.143417 0.142876 0.197699 0.242208
qa: -0.0999 -0.4287 0.1420 -0.3081 -0.0917 0.3994 0.1943 -0.0861 -0.2482 -0.1454 -0.2187 -0.1227 -0.3402 -0.3870 0.0034 0.1917 -0.2322 -0.1848 -0.1476 -0.1481 0.1548 0.0938 0.0815 0.0849 0.0821 0.0860 0.0841 0.1681 0.1514 0.1124 0.1087 0.0924 0.1103 0.0939 0.1049 0.1101 0.1021 0.2223 0.2080 0.1400 0.1405 0.1434 0.1429 0.1977 0.2422
va: 1.2046 2.0167 3.4494 2.8648 3.5600 3.8164 3.8074 3.9191 3.9697 3.9067 3.8272 3.7676 3.9127 3.9292 3.5697 3.9166 3.9940 3.9356 3.9816 4.0011 3.9228 3.8286 1.0385 1.0123 1.0208 1.0037 1.0164 0.9990 0.9949 0.9995 1.0040 1.0206 1.0034 1.0048 1.0074 1.0019 1.0117 1.0213 0.9878 1.0056 1.0045 1.0061 1.0060 0.9781 0.9684
dispersion: -0.026803782 hartree
energy: -1361.327398724465 hartree
dipole: 38.82638 -36.23059 2.59578 2.26968 2.15170 4.42137 -2.17323 5.14109 2.96786
magnitude: 5.92409 au
magnitude: 15.05784 debye
