program: Orca
programVersion: 5.0.2
elementType: Cl O N N N C C C C C C C C C C C C C C C C C H H H H H H H H H H H H H H H H H H H H H H H
charge: 1
multiplicity: 1
keywords: wb97x-d3
keywords: def2-TZVPP
keywords: def2/J RIJCOSX
keywords: DEFGRID2
keywords: scfconv7
keywords: smallprint printgap noloewdin
keywords: NOSOSCF
formula: C17H23ClN3O
InChI: InChI=1/C17H23ClN3O/c1-16(2)8-7-14(9-13-3-5-15(18)6-4-13)17(16,22)10-21-12-19-11-20-21/h3-6,11-12,14,19,22H,7-10H2,1-2H3
45 atoms
Cl -4.988149 -4.298092 -1.11089
O  1.59501 0.718109 2.103527
N  1.827091 3.168698 0.823451
N  2.500477 3.852524 -0.116964
N  3.118188 4.471419 1.870957
C  1.315391 0.730232 0.714927
C  2.550491 0.245968 -0.107306
C  0.185981 -0.312892 0.394483
C  2.393055 -1.277921 0.002527
C  0.907698 -1.529936 -0.217834
C  0.840614 2.15903 0.45669
C  -0.987885 0.16243 -0.475412
C  3.907495 0.68965 0.43165
C  2.44621 0.663517 -1.577129
C  -2.006509 -0.930298 -0.654318
C  2.19021 3.536413 2.031097
C  -2.828914 -1.309745 0.405007
C  -2.136304 -1.611698 -1.860328
C  -3.746701 -2.339318 0.273918
C  -3.049045 -2.64664 -2.012712
C  3.287713 4.643177 0.538188
C  -3.846631 -3.003914 -0.939094
H  -0.240638 -0.587408 1.363346
H  2.703644 -1.625027 0.994587
H  3.026463 -1.803789 -0.714717
H  0.696832 -1.599996 -1.287512
H  0.572346 -2.46854 0.223652
H  -0.053687 2.363198 1.046027
H  0.59856 2.334374 -0.587516
H  -0.631662 0.485595 -1.456419
H  -1.47929 1.023319 -0.015203
H  4.084557 1.759633 0.319114
H  4.052099 0.431683 1.480733
H  4.698494 0.186965 -0.129322
H  2.608426 1.73343 -1.712511
H  3.21306 0.148462 -2.159046
H  1.485072 0.419031 -2.030329
H  1.927297 -0.148065 2.364861
H  1.803035 3.173999 2.967795
H  -2.757138 -0.793526 1.355344
H  -1.515924 -1.334345 -2.704046
H  -4.376658 -2.617668 1.10823
H  -3.131303 -3.163564 -2.959546
H  3.979447 5.343946 0.101698
H  3.597976 4.963789 2.616489
elementType: Cl O N C H
totalener: -1361.30292355 hartree
nucrepener: 1973.87322638 hartree
electener: -3335.17614993 hartree
oneelecener: -5759.67339490 hartree
twoeener: 2424.49724497 hartree
cpcmener: -0.10468177 hartree
kineticenergy: 1356.43764461 hartree
xcener: -110.339702020229 hartree
chargesum: 1.0000000
charge: -0.100659 -0.430999 0.145889 -0.303699 -0.090497 0.436909 0.196355 -0.108952 -0.245157 -0.177260 -0.210661 -0.083834 -0.341873 -0.388715 -0.011705 0.193053 -0.213572 -0.195841 -0.165199 -0.169434 0.153674 0.108252 0.083577 0.084289 0.084098 0.089056 0.091140 0.157115 0.149667 0.109865 0.102953 0.092103 0.092700 0.110674 0.100793 0.104515 0.112608 0.225294 0.207049 0.141159 0.141099 0.141500 0.141540 0.198447 0.242683
qa: -0.1007 -0.4310 0.1459 -0.3037 -0.0905 0.4369 0.1964 -0.1090 -0.2452 -0.1773 -0.2107 -0.0838 -0.3419 -0.3887 -0.0117 0.1931 -0.2136 -0.1958 -0.1652 -0.1694 0.1537 0.1083 0.0836 0.0843 0.0841 0.0891 0.0911 0.1571 0.1497 0.1099 0.1030 0.0921 0.0927 0.1107 0.1008 0.1045 0.1126 0.2253 0.2070 0.1412 0.1411 0.1415 0.1415 0.1984 0.2427
va: 1.2039 2.0223 3.4349 2.8634 3.5588 3.7994 3.8050 3.8810 3.9820 3.9049 3.8025 3.7396 3.9135 3.9376 3.5681 3.9151 3.9801 3.9554 4.0056 4.0189 3.9240 3.8242 1.0407 1.0129 1.0190 1.0061 1.0141 1.0057 0.9953 1.0011 1.0137 1.0054 1.0196 1.0032 1.0114 1.0065 1.0004 1.0193 0.9888 1.0048 1.0060 1.0073 1.0069 0.9780 0.9681
dispersion: -0.025918647 hartree
energy: -1361.328842201405 hartree
dipole: 30.39222 -24.90931 5.48291 13.38479 -6.49145 6.89334 1.74954 1.56713 3.31667
magnitude: 9.41173 au
magnitude: 23.92273 debye
