program: Gaussian 09
title: 000071029
version: EM64L-G09RevD.01
frameworkgroup: C1[X(C11H9N5)]
method: RPBEPBE
basis: SDD
operation: Freq
keyword: #pfreq=noraman
keyword: PBEPBE/SDD
title: #p freq=noraman PBEPBE/SDD
converged: YES YES NO NO
title: Mulliken charges:
elementType: N N N N N C C C C C C C C C C C H H H H H H H H H
charge: -0.448776 -0.405931 -0.090253 -0.016436 0.036932 0.078466 0.210719 -0.088165 0.463208 -0.223067 -0.457261 -0.327278 -0.380129 -0.198631 -0.218884 -0.255851 0.287259 0.305501 0.265527 0.210478 0.321115 0.247216 0.226600 0.227251 0.230390
chargesum: 0.00000
title: Mulliken charges with hydrogens summed into heavy atoms:
elementType: N N N N N C C C C C C C C C C C
charge: -0.161517 -0.100429 -0.090253 -0.016436 0.036932 0.078466 0.210719 -0.088165 0.463208 0.042460 -0.246783 -0.006163 -0.132913 0.027969 0.008367 -0.025461
polarizability: 2.65906027e+02 -1.76345077e+00 1.65025996e+02 2.10225350e-02 1.15567992e-01 5.88128445e+01
1716.lowfreq: -8.5697 -4.6550 -0.0007 -0.0004 0.0005 4.9630 36.5430 51.1639 102.4227
frequency: 36.5060 51.1556 102.4223 134.1631 202.0895 211.9577 238.1829 290.0423 303.2728 409.0703 467.0768 482.6970 525.1113 534.8869 563.0510 577.0414 579.4612 608.5156 614.8919 652.3726 669.6749 696.6197 760.5301 765.5770 788.2161 806.5054 829.9291 840.1699 851.7388 903.4768 917.9634 929.3192 972.2388 983.8823 1007.4800 1018.7072 1034.8386 1075.8465 1083.9947 1122.1978 1171.8432 1188.3491 1220.0628 1246.7633 1267.8160 1295.3065 1319.2591 1332.7422 1338.1239 1366.9238 1393.3368 1418.5067 1432.7129 1447.4507 1485.4694 1511.1383 1521.0282 1588.2045 1610.2742 1616.1246 3099.8059 3133.0734 3144.8110 3165.4095 3166.4847 3193.2583 3234.8329 3541.4912 3582.9499
redmass: 4.4889 5.5075 5.5510 4.8967 4.8096 5.9639 4.7453 5.8456 5.3066 2.9460 6.2704 1.6113 1.9070 9.5239 3.0192 1.8414 7.7162 2.4165 6.4783 8.0860 5.8907 1.9785 8.3989 1.7026 5.6382 5.8991 1.6199 1.2855 7.8379 7.5340 1.4085 1.4305 1.3440 6.1366 1.3016 3.2352 2.3397 2.3593 1.6548 3.6337 1.0572 1.1127 2.4834 2.5210 6.1375 4.6400 1.5349 1.9921 3.1042 2.7275 3.8736 2.7056 2.3850 2.8049 2.3718 2.8620 4.8814 7.3771 3.9829 5.1185 1.0889 1.0865 1.0931 1.0922 1.0995 1.0953 1.0989 1.0753 1.0820
irintensity: 0.3324 2.9432 3.3757 6.3856 0.3028 0.5167 0.0056 0.1556 6.0291 0.0007 7.4763 16.6594 29.1688 2.6793 52.9169 95.3959 7.5246 7.6551 1.7490 8.8635 3.8841 47.8370 1.8873 93.3695 0.7180 1.8062 24.2718 0.0043 9.5906 2.9475 13.3296 11.7947 0.1442 0.4660 3.2050 1.1687 35.4021 12.5996 20.7451 0.6044 0.2535 2.1777 49.0656 12.8048 2.3356 81.4011 11.6011 8.4846 70.9136 30.3895 91.6180 73.3965 13.6506 12.7294 119.1607 153.7417 279.8114 310.0851 317.8381 26.0171 19.1711 0.0974 28.7357 19.5680 24.3720 17.4386 1.3497 15.5139 32.3062
temp: 298.150 k
press: 1.00000 atm
elementType: 7 7 7 7 7 6 6 6 6 6 6 6 6 6 6 6 1 1 1 1 1 1 1 1 1
symmnumber: 1
zpe: 494514.8 jmol-1
zpe.correction: 0.188351 hartree
zpe.thermalcorrener: 0.200263 hartree
zpe.thermalcorrenthalpy: 0.201207 hartree
zpe.thermalcorrgfe: 0.149137 hartree
zpe.sumelectzpe: -697.226516 hartree
zpe.sumelectthermal: -697.214604 hartree
zpe.sumelectthermalent: -697.213660 hartree
zpe.sumelectthermalfe: -697.265730 hartree
dipole: -3.5561 -6.4554 0.0028
dipole: 7.3701
quadrupole: -107.3771 -75.4036 -97.7742
quadrupole: -15.5194 -0.0078 0.0662
quadrupole: -13.8588 18.1147 -4.2559 -15.5194 -0.0078 0.0662
hfenergy: -697.4148669 hartree
pointgroup: C01 [X(C11H9N5)]
dipole: 1.4413851 2.5076936 0.2040602 debye
dipolederiv: -2.1807822 -0.2418322 -0.0469467 -0.6400238 -0.2855782 -0.0060996 -0.0746627 0.0001134 -0.3388825 -0.4981576 -0.1286256 -0.0149348 0.0424546 -0.5474661 -0.0242681 -0.0006067 -0.0294529 -0.2404449 -0.7458601 -0.0706352 -0.0129364 -0.6890195 -0.7124042 -0.0483374 -0.0584696 -0.0394701 -0.2043655 -0.3328859 0.1550288 0.010624 -0.05496 -0.606516 -0.0271729 -0.0050177 -0.0240359 -0.2622526 -0.5786891 0.1160486 0.0033916 -0.2360767 -0.5595806 -0.0307156 -0.0227467 -0.024817 -0.2075997 -1.0779118 -0.1413538 -0.0266198 -0.21686 0.2721958 0.014989 -0.0321812 0.0163025 0.0432126 2.1204386 0.3644134 0.0560474 1.1302364 0.6393478 0.0501111 0.1077857 0.0377573 0.2082843 0.6297143 -0.3743728 -0.0203095 0.1904979 0.5597483 0.0393681 0.0212269 0.0312531 0.0805918 1.5501737 -0.0279943 0.0213951 -0.4213269 0.0332282 -0.0121208 -0.0080844 -0.0058114 0.0994512 0.5090317 0.2599227 0.0278149 0.4232852 0.3703866 0.0384717 0.0384855 0.0364683 -0.045367 -0.3798126 0.0084707 -0.0019458 -0.1534988 0.045539 0.0147245 -0.0124286 0.0175708 -0.2204527 -0.3555135 0.0002277 -0.0028827 0.2560519 -0.079984 0.0095199 0.0148138 0.006173 -0.1607199 0.6447503 0.0327358 0.0121229 0.2781016 0.6099967 0.0543306 0.0309602 0.0502437 -0.0584004 0.1181539 0.0002645 0.0043198 0.1145743 0.1183113 0.0184995 0.0106501 0.0162986 -0.1365446 0.1069024 -0.0077402 0.0033548 -0.1181631 0.1641129 0.0175007 -0.0031211 0.0195161 -0.1375089 -0.0993339 -0.0489933 -0.0017679 -0.0352092 -0.1484258 0.0021432 -0.0009565 0.001977 -0.1869965 0.1226223 0.0193698 -0.0013869 0.0918499 0.0844747 -0.0134635 0.0056913 -0.0145846 0.2932726 0.1274027 -0.0534413 -0.0064866 -0.0442328 0.19146 -0.0123613 -0.0056667 -0.0105856 0.3534179 0.0938841 0.0423103 0.0019979 0.0480948 0.0127876 -0.0119441 0.0025919 -0.0123375 0.1802001 0.0366198 0.1171118 0.0055584 0.0848146 -0.0946633 -0.0155599 0.0038994 -0.0151066 0.1667255 0.2254664 -0.044462 -0.0016877 -0.0496321 0.0613203 -0.0078102 -0.0014491 -0.0081182 0.1691697 0.0788679 0.0339425 0.0017261 -0.0078643 -0.0828688 -0.0159757 -0.0014761 -0.0150154 0.1281327 -0.0222257 -0.1000984 -0.0093923 -0.1266117 -0.0381345 -0.0147405 -0.0110327 -0.0143553 0.1565444 0.0452365 0.0524917 0.0015543 0.094761 -0.0908729 -0.0141484 0.0041063 -0.0149605 0.1511486 -0.1380922 0.0372108 -0.0026101 0.0387571 0.083585 -0.0049403 -0.0023111 -0.0050228 0.1693839 unknown
polarizability: 265.7694312|-3.6756389|164.5895656|2.9207844|7.4468953|59.385871 unknown
InChI: InChI=1S/C11H9N5/c1-2-4-8(5-3-1)16-11-9-10(13-6-12-9)14-7-15-11/h1-7,12,16H
charge 0 multiplicity 1
25 atoms
N  0.588813 0.707078 0.021973
N  -2.378633 1.810788 0.063806
N  -0.480242 -1.437368 -0.151901
N  -4.192594 0.418976 -0.065392
N  -2.922087 -1.710251 -0.206789
C  -1.860054 0.510199 -0.027724
C  -0.557817 -0.077809 -0.052173
C  -3.007064 -0.345074 -0.106515
C  1.967638 0.34858 0.019281
C  -3.775889 1.68761 0.035184
C  2.901682 1.419465 0.104202
C  2.441135 -0.988413 -0.060289
C  -1.645222 -2.165543 -0.222679
C  4.286054 1.16087 0.109896
C  3.83231 -1.228959 -0.052985
C  4.763018 -0.168798 0.031451
H  0.428286 1.713321 0.091446
H  -1.868048 2.689837 0.130916
H  -4.43092 2.554783 0.091816
H  2.543305 2.456518 0.165488
H  1.717587 -1.801686 -0.126514
H  -1.513045 -3.248587 -0.300989
H  4.990972 1.996912 0.17544
H  4.188624 -2.263431 -0.114031
H  5.838991 -0.371617 0.03588
