program: Orca
programVersion: 5.0.2
elementType: Cl O N N N C C C C C C C C C C C C C C C C C H H H H H H H H H H H H H H H H H H H H H H H
charge: 1
multiplicity: 1
keywords: wb97x-d3
keywords: def2-TZVPP
keywords: def2/J RIJCOSX
keywords: DEFGRID2
keywords: scfconv7
keywords: smallprint printgap noloewdin
keywords: NOSOSCF
formula: C17H23ClN3O
InChI: InChI=1/C17H23ClN3O/c1-16(2)8-7-14(9-13-3-5-15(18)6-4-13)17(16,22)10-21-12-19-11-20-21/h3-6,11-12,14,19,22H,7-10H2,1-2H3
45 atoms
Cl 5.018254 -0.175771 0.205822
O  -2.122415 -0.134895 -1.836639
N  -0.188814 1.4542 -0.558131
N  0.45904 2.580083 -0.199374
N  1.665713 1.404989 -1.571344
C  -2.212168 -0.058912 -0.423451
C  -3.713701 0.00065 0.007389
C  -1.698346 -1.442875 0.095741
C  -4.136543 -1.459179 -0.179351
C  -2.976949 -2.260355 0.391371
C  -1.480542 1.189915 0.069737
C  -0.75943 -1.482671 1.313018
C  -4.557821 0.947655 -0.840144
C  -3.863247 0.410325 1.47649
C  0.686791 -1.157177 1.056661
C  0.536939 0.73163 -1.380402
C  1.322021 -0.100125 1.701466
C  1.438369 -1.930002 0.171281
C  2.654128 0.204463 1.454265
C  2.768165 -1.642747 -0.090169
C  1.59071 2.52995 -0.824058
C  3.365093 -0.568158 0.551969
H  -1.167531 -1.908527 -0.738635
H  -4.27425 -1.676016 -1.241482
H  -5.085514 -1.673702 0.31603
H  -3.099795 -2.376177 1.470921
H  -2.910681 -3.266851 -0.022324
H  -1.303803 1.15154 1.143312
H  -2.085091 2.077226 -0.124023
H  -0.803282 -2.507272 1.693858
H  -1.143934 -0.854875 2.120031
H  -4.188192 1.975556 -0.812791
H  -4.625689 0.636266 -1.883666
H  -5.578669 0.969146 -0.455489
H  -3.240101 -0.170023 2.157039
H  -3.625521 1.464369 1.630538
H  -4.89961 0.269776 1.787978
H  -2.523898 0.651305 -2.224496
H  0.28726 -0.206756 -1.841732
H  0.768331 0.510127 2.405065
H  0.978236 -2.768886 -0.337351
H  3.12267 1.039754 1.956998
H  3.328515 -2.248787 -0.789375
H  2.369501 3.272033 -0.773237
H  2.447983 1.094695 -2.136364
elementType: Cl O N C H
totalener: -1361.29432620 hartree
nucrepener: 2111.83561192 hartree
electener: -3473.12993813 hartree
oneelecener: -6032.45379266 hartree
twoeener: 2559.32385453 hartree
cpcmener: -0.11107999 hartree
kineticenergy: 1356.45130596 hartree
xcener: -110.347717726894 hartree
chargesum: 1.0000000
charge: -0.101444 -0.447081 0.175738 -0.307002 -0.085115 0.413542 0.236407 -0.069288 -0.230665 -0.161850 -0.265792 -0.140623 -0.353358 -0.388323 0.050984 0.127726 -0.203003 -0.263152 -0.147231 -0.097456 0.143158 0.064556 0.087647 0.080654 0.085587 0.085727 0.081800 0.154319 0.156727 0.111145 0.118142 0.110445 0.091369 0.102491 0.110630 0.102931 0.103259 0.230785 0.220324 0.148581 0.140442 0.144029 0.140940 0.196899 0.244397
qa: -0.1014 -0.4471 0.1757 -0.3070 -0.0851 0.4135 0.2364 -0.0693 -0.2307 -0.1618 -0.2658 -0.1406 -0.3534 -0.3883 0.0510 0.1277 -0.2030 -0.2632 -0.1472 -0.0975 0.1432 0.0646 0.0876 0.0807 0.0856 0.0857 0.0818 0.1543 0.1567 0.1111 0.1181 0.1104 0.0914 0.1025 0.1106 0.1029 0.1033 0.2308 0.2203 0.1486 0.1404 0.1440 0.1409 0.1969 0.2444
va: 1.2031 2.0047 3.3871 2.8880 3.5630 3.7832 3.7981 3.8083 3.9444 3.9327 3.8589 3.8087 3.9236 3.9527 3.4398 3.9675 3.8979 3.9566 3.8907 3.9242 3.9587 3.7833 1.0342 1.0270 1.0177 1.0017 1.0137 0.9846 1.0065 1.0018 1.0080 1.0003 1.0115 1.0010 1.0001 0.9974 1.0056 1.0067 0.9800 1.0042 1.0054 1.0068 1.0067 0.9818 0.9672
dispersion: -0.030276023 hartree
energy: -1361.324602227586 hartree
dipole: -41.76695 41.66230 -0.10465 -3.37561 5.18519 1.80958 2.57258 -4.55292 -1.98034
magnitude: 2.68464 au
magnitude: 6.82381 debye
