program: Orca
programVersion: 5.0.2
elementType: Cl O N N N C C C C C C C C C C C C C C C C C H H H H H H H H H H H H H H H H H H H H H H H
charge: 1
multiplicity: 1
keywords: wb97x-d3
keywords: def2-TZVPP
keywords: def2/J RIJCOSX
keywords: DEFGRID2
keywords: scfconv7
keywords: smallprint printgap noloewdin
keywords: NOSOSCF
formula: C17H23ClN3O
InChI: InChI=1/C17H23ClN3O/c1-16(2)8-7-14(9-13-3-5-15(18)6-4-13)17(16,22)10-21-12-19-11-20-21/h3-6,11-12,14,19,22H,7-10H2,1-2H3
45 atoms
Cl 4.87637 0.28451 1.048725
O  -2.536566 0.270251 -1.895456
N  -0.102827 1.291562 -0.908927
N  0.917967 1.979834 -0.36121
N  1.472802 1.218379 -2.318466
C  -2.23779 0.02002 -0.530491
C  -3.557706 -0.00588 0.349791
C  -1.63841 -1.403626 -0.392993
C  -3.850728 -1.516774 0.541155
C  -2.907264 -2.262107 -0.396542
C  -1.339861 1.176799 -0.131344
C  -0.82108 -1.685682 0.879024
C  -4.718667 0.68059 -0.371641
C  -3.411246 0.673787 1.715041
C  0.594401 -1.171956 0.905665
C  0.224473 0.825162 -2.092867
C  1.065483 -0.435181 1.988833
C  1.488862 -1.462971 -0.123713
C  2.380371 0.006769 2.052602
C  2.80216 -1.021516 -0.085406
C  1.873999 1.91462 -1.229999
C  3.237365 -0.287478 1.007724
H  -1.013457 -1.631354 -1.260866
H  -4.899163 -1.750488 0.348775
H  -3.652527 -1.810941 1.5746
H  -2.712211 -3.287441 -0.079712
H  -3.329395 -2.331112 -1.403486
H  -1.022773 1.094858 0.904159
H  -1.873893 2.122733 -0.239114
H  -0.778401 -2.774233 0.982827
H  -1.341905 -1.330751 1.769434
H  -5.01303 0.169142 -1.28853
H  -5.592365 0.684692 0.282706
H  -4.494266 1.720069 -0.618734
H  -3.273089 1.753302 1.63033
H  -4.32591 0.51445 2.288822
H  -2.589749 0.274356 2.31035
H  -3.045349 -0.462284 -2.260465
H  -0.380669 0.248858 -2.769482
H  0.393718 -0.195765 2.804672
H  1.16399 -2.04464 -0.978136
H  2.720407 0.581118 2.903899
H  3.476456 -1.252371 -0.899099
H  2.850075 2.357202 -1.124792
H  2.020791 1.00302 -3.143131
elementType: Cl O N C H
totalener: -1361.29192358 hartree
nucrepener: 2116.59176045 hartree
electener: -3477.88368404 hartree
oneelecener: -6042.71693915 hartree
twoeener: 2564.83325512 hartree
cpcmener: -0.11311702 hartree
kineticenergy: 1356.43441238 hartree
xcener: -110.343964966986 hartree
chargesum: 1.0000000
charge: -0.108846 -0.451539 0.151963 -0.293084 -0.084972 0.435447 0.073738 0.056852 -0.161933 -0.218424 -0.236964 -0.199035 -0.342571 -0.374533 0.061714 0.170853 -0.182346 -0.262811 -0.175861 -0.173709 0.131185 0.130393 0.098257 0.079180 0.087189 0.080476 0.087910 0.154903 0.158724 0.108066 0.130718 0.096276 0.101027 0.096306 0.103897 0.107875 0.103149 0.228924 0.208281 0.147058 0.149190 0.142024 0.145203 0.195429 0.244419
qa: -0.1088 -0.4515 0.1520 -0.2931 -0.0850 0.4354 0.0737 0.0569 -0.1619 -0.2184 -0.2370 -0.1990 -0.3426 -0.3745 0.0617 0.1709 -0.1823 -0.2628 -0.1759 -0.1737 0.1312 0.1304 0.0983 0.0792 0.0872 0.0805 0.0879 0.1549 0.1587 0.1081 0.1307 0.0963 0.1010 0.0963 0.1039 0.1079 0.1031 0.2289 0.2083 0.1471 0.1492 0.1420 0.1452 0.1954 0.2444
va: 1.1947 1.9856 3.4250 2.8847 3.5522 3.7186 3.8830 3.8938 3.8828 4.0133 3.8890 3.8408 3.9648 3.9368 3.4886 3.9178 3.9308 3.9019 4.0240 3.9347 3.9557 3.7384 1.0052 1.0140 1.0037 1.0168 1.0110 0.9884 1.0030 1.0030 0.9886 1.0033 0.9998 1.0075 0.9977 1.0014 1.0012 1.0152 1.0001 0.9991 1.0052 1.0070 1.0068 0.9827 0.9679
dispersion: -0.030427244 hartree
energy: -1361.322350826136 hartree
dipole: -40.85090 40.35082 -0.50008 -6.26850 6.63238 0.36389 -0.29517 -3.33092 -3.62609
magnitude: 3.67846 au
magnitude: 9.34989 debye
