program: Orca
programVersion: 5.0.2
elementType: N C C C C C C C C C C C C C C C C C C C C C H H H H H H H H H H H H H H H H H H H H H H
charge: 1
multiplicity: 1
keywords: wb97x-d3
keywords: def2-TZVPP
keywords: def2/J RIJCOSX
keywords: DEFGRID2
keywords: scfconv7
keywords: smallprint printgap noloewdin
keywords: NOSOSCF
formula: C21H22N
InChI: InChI=1/C21H22N/c1-22(16-8-11-18-9-3-2-4-10-18)17-20-14-7-13-19-12-5-6-15-21(19)20/h2-15,22H,16-17H2,1H3
44 atoms
N  1.882748 -1.047454 -0.112053
C  2.740244 -0.120118 0.716637
C  1.915758 0.763012 1.601019
C  1.632691 2.119741 1.270843
C  0.822816 2.872598 2.165028
C  0.98252 -0.315933 -1.089511
C  1.426993 0.221225 2.76587
C  2.704191 -2.086302 -0.779687
C  2.11339 2.766307 0.107287
C  0.326651 2.2660 3.339515
C  0.62145 0.966947 3.640184
C  0.527859 4.222557 1.869546
C  -0.009267 -1.23552 -1.710359
C  1.810859 4.074601 -0.150263
C  1.00897 4.814367 0.737638
C  -1.253211 -1.34723 -1.229298
C  -2.324742 -2.20194 -1.724178
C  -2.230649 -2.923622 -2.917174
C  -3.492653 -2.307879 -0.96777
C  -3.269201 -3.73624 -3.328311
C  -4.532471 -3.12575 -1.377441
C  -4.421259 -3.843604 -2.557531
H  3.381144 0.419692 0.021766
H  3.385439 -0.764224 1.314965
H  1.644649 0.150063 -1.821063
H  0.492787 0.473412 -0.522031
H  1.682324 -0.798277 3.037871
H  3.367788 -1.607572 -1.496039
H  2.056653 -2.790749 -1.293107
H  3.295132 -2.615804 -0.036879
H  2.746635 2.241436 -0.595915
H  -0.286857 2.853513 4.010858
H  0.252398 0.514124 4.549586
H  -0.084442 4.785569 2.562452
H  0.30302 -1.797627 -2.582397
H  2.197105 4.548582 -1.042359
H  0.781396 5.849123 0.522364
H  -1.51704 -0.739897 -0.365343
H  -1.350704 -2.841905 -3.542147
H  -3.587139 -1.745426 -0.046478
H  -3.187276 -4.284915 -4.256601
H  -5.429646 -3.198978 -0.778279
H  -5.23204 -4.480907 -2.883536
H  1.249701 -1.522468 0.535786
totalener: -868.05479187 hartree
nucrepener: 1623.48834120 hartree
electener: -2491.54313307 hartree
oneelecener: -4376.62022782 hartree
twoeener: 1885.07709475 hartree
kineticenergy: 864.00584282 hartree
xcener: -88.298838872993 hartree
chargesum: 1.0000000
charge: 0.189021 -0.196627 0.102493 -0.093173 -0.030372 -0.161551 -0.182590 -0.185400 -0.186631 -0.071954 -0.119669 -0.039773 -0.224554 -0.101748 -0.109239 0.027001 0.048236 -0.186251 -0.132721 -0.125130 -0.137559 -0.090493 0.156365 0.159243 0.154714 0.161860 0.134717 0.135675 0.142002 0.133843 0.112033 0.129780 0.146686 0.126370 0.119798 0.141147 0.146303 0.099191 0.119418 0.114848 0.139995 0.140430 0.145846 0.148420
qa: 0.1890 -0.1966 0.1025 -0.0932 -0.0304 -0.1616 -0.1826 -0.1854 -0.1866 -0.0720 -0.1197 -0.0398 -0.2246 -0.1017 -0.1092 0.0270 0.0482 -0.1863 -0.1327 -0.1251 -0.1376 -0.0905 0.1564 0.1592 0.1547 0.1619 0.1347 0.1357 0.1420 0.1338 0.1120 0.1298 0.1467 0.1264 0.1198 0.1411 0.1463 0.0992 0.1194 0.1148 0.1400 0.1404 0.1458 0.1484
va: 3.5983 3.8307 3.3761 3.8573 4.0038 3.9080 4.0233 3.8568 3.9534 3.9958 4.0130 3.9244 3.8386 4.0296 3.9877 3.8963 3.7331 4.0286 4.0000 3.9882 3.9917 3.9607 1.0016 0.9977 0.9982 1.0056 1.0046 0.9937 0.9971 0.9996 1.0143 1.0100 0.9989 1.0112 1.0161 0.9994 0.9972 1.0204 1.0157 1.0141 1.0001 0.9998 0.9957 1.0227
dispersion: -0.019256102 hartree
energy: -868.074047975738 hartree
dipole: 5.95075 -3.99794 1.95281 -6.90835 5.76318 -1.14517 -4.29269 4.16829 -0.12440
magnitude: 2.26723 au
magnitude: 5.76285 debye
