program: Orca
programVersion: 5.0.2
elementType: N C C C C C C C C C C C C C C C C C C C C C H H H H H H H H H H H H H H H H H H H H H H
charge: 1
multiplicity: 1
keywords: wb97x-d3
keywords: def2-TZVPP
keywords: def2/J RIJCOSX
keywords: DEFGRID2
keywords: scfconv7
keywords: smallprint printgap noloewdin
keywords: NOSOSCF
formula: C21H22N
InChI: InChI=1/C21H22N/c1-22(16-8-11-18-9-3-2-4-10-18)17-20-14-7-13-19-12-5-6-15-21(19)20/h2-15,22H,16-17H2,1H3
44 atoms
N  0.884482 -0.549922 0.25876
C  0.036623 0.523162 0.879389
C  0.730434 1.850094 0.922841
C  1.764381 2.115534 1.867996
C  2.406727 3.383111 1.8373
C  0.277666 -1.91648 0.440439
C  0.359402 2.822131 0.029346
C  1.217122 -0.267307 -1.156663
C  2.182247 1.178618 2.844366
C  1.994822 4.353029 0.894127
C  0.986739 4.082311 0.013778
C  3.445661 3.659876 2.755559
C  -1.036873 -2.065512 -0.242192
C  3.18909 1.476979 3.722635
C  3.834526 2.727227 3.67628
C  -1.173025 -2.80304 -1.345887
C  -2.407992 -3.051662 -2.091781
C  -2.319845 -3.711555 -3.319286
C  -3.670362 -2.659227 -1.635907
C  -3.453789 -3.967315 -4.076129
C  -4.802641 -2.917334 -2.389877
C  -4.699923 -3.570815 -3.613384
H  -0.242212 0.167824 1.871213
H  -0.869976 0.590414 0.281494
H  0.189794 -2.060714 1.51754
H  1.010538 -2.624818 0.057412
H  -0.429236 2.615407 -0.683472
H  1.788347 -1.102317 -1.551696
H  1.817019 0.635166 -1.210416
H  0.302701 -0.138552 -1.727774
H  1.69938 0.212905 2.923657
H  2.490401 5.316091 0.885502
H  0.667642 4.828065 -0.701745
H  3.929929 4.627879 2.716248
H  -1.888055 -1.569387 0.210973
H  3.487896 0.746642 4.462878
H  4.631216 2.947101 4.374264
H  -0.285191 -3.273813 -1.75923
H  -1.349097 -4.025318 -3.684241
H  -3.776281 -2.156414 -0.682949
H  -3.362739 -4.478526 -5.025513
H  -5.772623 -2.61112 -2.020432
H  -5.587827 -3.77165 -4.198354
H  1.771041 -0.582967 0.768469
elementType: N C H
totalener: -868.14087738 hartree
nucrepener: 1597.75876588 hartree
electener: -2465.89964326 hartree
oneelecener: -4324.38036323 hartree
twoeener: 1858.48071996 hartree
cpcmener: -0.11096905 hartree
kineticenergy: 863.98577848 hartree
xcener: -88.296368422502 hartree
chargesum: 1.0000000
charge: 0.217402 -0.075855 -0.008392 -0.065432 -0.043612 -0.052235 -0.116972 -0.225628 -0.233167 -0.129348 -0.139751 -0.090276 -0.215540 -0.146418 -0.154571 -0.035894 0.047346 -0.166853 -0.214288 -0.170064 -0.159879 -0.149776 0.165896 0.141207 0.145678 0.141470 0.144772 0.147789 0.149591 0.140554 0.151529 0.146836 0.160552 0.146287 0.143202 0.160029 0.161303 0.125120 0.143709 0.145839 0.160143 0.160328 0.163020 0.184345
qa: 0.2174 -0.0759 -0.0084 -0.0654 -0.0436 -0.0522 -0.1170 -0.2256 -0.2332 -0.1293 -0.1398 -0.0903 -0.2155 -0.1464 -0.1546 -0.0359 0.0473 -0.1669 -0.2143 -0.1701 -0.1599 -0.1498 0.1659 0.1412 0.1457 0.1415 0.1448 0.1478 0.1496 0.1406 0.1515 0.1468 0.1606 0.1463 0.1432 0.1600 0.1613 0.1251 0.1437 0.1458 0.1601 0.1603 0.1630 0.1843
va: 3.5940 3.8039 3.5227 3.9041 3.8796 3.8777 3.9031 3.8881 3.9559 3.9231 3.9005 3.8702 3.8512 3.9216 3.9067 3.8132 3.6742 3.9333 3.9611 3.9032 3.8997 3.8855 0.9805 0.9975 0.9992 0.9978 1.0020 0.9940 0.9888 0.9890 1.0043 1.0033 0.9902 1.0038 1.0028 0.9921 0.9890 1.0165 1.0073 1.0112 0.9912 0.9913 0.9884 0.9874
dispersion: -0.019265793 hartree
energy: -868.160143176592 hartree
dipole: 0.29017 1.19799 1.48816 -5.46268 4.52682 -0.93585 -3.01979 3.32827 0.30848
magnitude: 1.78482 au
magnitude: 4.53666 debye
