program: Orca
programVersion: 5.0.2
elementType: N C C C C C C C C C C C C C C C C C C C C C H H H H H H H H H H H H H H H H H H H H H H
charge: 1
multiplicity: 1
keywords: wb97x-d3
keywords: def2-TZVPP
keywords: def2/J RIJCOSX
keywords: DEFGRID2
keywords: scfconv7
keywords: smallprint printgap noloewdin
keywords: NOSOSCF
formula: C21H22N
InChI: InChI=1/C21H22N/c1-22(16-8-11-18-9-3-2-4-10-18)17-20-14-7-13-19-12-5-6-15-21(19)20/h2-15,22H,16-17H2,1H3
44 atoms
N  0.725431 -0.427488 -0.045751
C  1.999027 0.36701 -0.010115
C  1.770059 1.774135 0.458883
C  2.036116 2.196391 1.794206
C  1.764159 3.548459 2.144811
C  0.945342 -1.733871 -0.759056
C  1.277382 2.674724 -0.453415
C  0.126904 -0.617997 1.295781
C  2.555888 1.341107 2.796945
C  1.243952 4.434708 1.174884
C  1.006268 4.008202 -0.100697
C  2.0143 3.99167 3.464734
C  -0.335485 -2.465473 -0.978478
C  2.788299 1.799718 4.06497
C  2.514608 3.138286 4.407251
C  -1.014129 -2.342218 -2.121072
C  -2.287352 -2.97707 -2.464278
C  -2.925393 -3.9080 -1.638437
C  -2.898362 -2.629149 -3.670944
C  -4.137841 -4.463208 -2.010485
C  -4.114767 -3.183161 -4.042309
C  -4.738837 -4.102684 -3.212114
H  2.377341 0.375108 -1.031046
H  2.70396 -0.196252 0.597139
H  1.64809 -2.303074 -0.151115
H  1.422205 -1.487283 -1.706176
H  1.092596 2.35129 -1.471495
H  -0.808418 -1.159453 1.194925
H  -0.077691 0.349018 1.74324
H  0.818708 -1.182918 1.914699
H  2.778074 0.307354 2.570766
H  1.039725 5.459427 1.460115
H  0.613244 4.688163 -0.844301
H  1.799298 5.023435 3.714951
H  -0.693105 -3.095728 -0.172632
H  3.186764 1.127139 4.813009
H  2.701948 3.485417 5.414664
H  -0.601989 -1.696115 -2.892121
H  -2.47561 -4.206082 -0.699813
H  -2.41475 -1.910858 -4.322262
H  -4.618178 -5.18325 -1.361012
H  -4.57398 -2.894891 -4.978796
H  -5.687412 -4.538498 -3.497108
H  0.051368 0.102165 -0.606983
elementType: N C H
totalener: -868.13980042 hartree
nucrepener: 1585.03965860 hartree
electener: -2453.17945902 hartree
oneelecener: -4298.99920627 hartree
twoeener: 1845.81974725 hartree
cpcmener: -0.11172630 hartree
kineticenergy: 863.98294504 hartree
xcener: -88.294425434664 hartree
chargesum: 1.0000000
charge: 0.222629 -0.088964 0.061310 -0.110521 -0.016097 -0.050231 -0.159969 -0.213634 -0.202110 -0.132161 -0.146117 -0.095641 -0.220654 -0.151924 -0.149136 -0.023337 0.029479 -0.213372 -0.160680 -0.162521 -0.173995 -0.146924 0.149165 0.152646 0.148110 0.131952 0.146973 0.142892 0.143371 0.144371 0.146954 0.146389 0.161716 0.144615 0.145730 0.159903 0.161944 0.126379 0.146438 0.145333 0.161342 0.160387 0.163066 0.174895
qa: 0.2226 -0.0890 0.0613 -0.1105 -0.0161 -0.0502 -0.1600 -0.2136 -0.2021 -0.1322 -0.1461 -0.0956 -0.2207 -0.1519 -0.1491 -0.0233 0.0295 -0.2134 -0.1607 -0.1625 -0.1740 -0.1469 0.1492 0.1526 0.1481 0.1320 0.1470 0.1429 0.1434 0.1444 0.1470 0.1464 0.1617 0.1446 0.1457 0.1599 0.1619 0.1264 0.1464 0.1453 0.1613 0.1604 0.1631 0.1749
va: 3.6543 3.8086 3.5155 3.8041 3.8562 3.8747 3.9478 3.8727 3.9214 3.9279 3.8969 3.8732 3.8971 3.9267 3.9031 3.8086 3.6866 3.9594 3.9293 3.9019 3.9062 3.8845 0.9973 0.9971 0.9977 1.0042 1.0014 0.9965 0.9888 0.9915 1.0039 1.0037 0.9895 1.0050 0.9976 0.9916 0.9885 1.0159 1.0109 1.0070 0.9910 0.9914 0.9883 0.9958
dispersion: -0.018775549 hartree
energy: -868.158575969022 hartree
dipole: -0.12659 1.28336 1.15677 -6.00942 5.26948 -0.73993 -0.34530 0.23999 -0.10532
magnitude: 1.37721 au
magnitude: 3.50059 debye
