program: Orca
programVersion: 5.0.2
elementType: N C C C C C C C C C C C C C C C C C C C C C H H H H H H H H H H H H H H H H H H H H H H
charge: 1
multiplicity: 1
keywords: wb97x-d3
keywords: def2-TZVPP
keywords: def2/J RIJCOSX
keywords: DEFGRID2
keywords: scfconv7
keywords: smallprint printgap noloewdin
keywords: NOSOSCF
formula: C21H22N
InChI: InChI=1/C21H22N/c1-22(16-8-11-18-9-3-2-4-10-18)17-20-14-7-13-19-12-5-6-15-21(19)20/h2-15,22H,16-17H2,1H3
44 atoms
N  1.53067 -0.461949 -0.567954
C  2.40451 0.745593 -0.76113
C  2.431587 1.608149 0.463309
C  1.319791 2.43613 0.799355
C  1.368411 3.18512 2.006396
C  1.209284 -1.121665 -1.880966
C  3.531166 1.578871 1.282671
C  2.103253 -1.41699 0.409485
C  0.164457 2.552349 -0.012299
C  2.520299 3.117795 2.824191
C  3.584529 2.34111 2.465176
C  0.26575 3.991677 2.371079
C  0.162637 -2.171631 -1.700027
C  -0.88401 3.348605 0.36318
C  -0.840506 4.069991 1.571417
C  -1.133631 -1.855559 -1.742985
C  -2.274448 -2.739672 -1.503428
C  -3.55762 -2.191794 -1.561351
C  -2.143056 -4.097233 -1.194021
C  -4.678963 -2.968992 -1.311253
C  -3.262425 -4.873644 -0.94788
C  -4.534608 -4.313453 -1.001879
H  2.021712 1.277323 -1.630999
H  3.398591 0.375972 -1.007977
H  2.144252 -1.521211 -2.270863
H  0.861648 -0.328903 -2.542025
H  4.373079 0.950578 1.018843
H  3.044003 -1.796677 0.019324
H  1.405304 -2.234206 0.563593
H  2.2676 -0.911912 1.356136
H  0.097189 2.023709 -0.954913
H  2.545091 3.69631 3.739552
H  4.466762 2.296239 3.089193
H  0.315116 4.550874 3.297347
H  0.499113 -3.181107 -1.495576
H  -1.75388 3.425215 -0.275682
H  -1.679488 4.689697 1.858635
H  -1.396791 -0.823179 -1.961647
H  -3.674916 -1.141164 -1.799051
H  -1.16362 -4.554904 -1.136371
H  -5.663684 -2.52272 -1.356479
H  -3.143405 -5.921985 -0.70727
H  -5.405799 -4.923709 -0.803377
H  0.634121 -0.142969 -0.188679
elementType: N C H
totalener: -868.14043777 hartree
nucrepener: 1616.82861118 hartree
electener: -2484.96904895 hartree
oneelecener: -4362.34342818 hartree
twoeener: 1877.37437923 hartree
cpcmener: -0.10971079 hartree
kineticenergy: 863.97791334 hartree
xcener: -88.293327524001 hartree
chargesum: 1.0000000
charge: 0.191265 -0.090327 0.047373 -0.082436 -0.045793 -0.053888 -0.143067 -0.197242 -0.225391 -0.137857 -0.127359 -0.089129 -0.220086 -0.147297 -0.154960 -0.016480 0.024447 -0.160665 -0.211461 -0.174390 -0.159400 -0.146369 0.157553 0.150868 0.149754 0.137659 0.148059 0.143045 0.141518 0.141484 0.148146 0.146861 0.161406 0.145594 0.145775 0.160526 0.161955 0.125409 0.145170 0.144672 0.159703 0.160586 0.163040 0.181729
qa: 0.1913 -0.0903 0.0474 -0.0824 -0.0458 -0.0539 -0.1431 -0.1972 -0.2254 -0.1379 -0.1274 -0.0891 -0.2201 -0.1473 -0.1550 -0.0165 0.0244 -0.1607 -0.2115 -0.1744 -0.1594 -0.1464 0.1576 0.1509 0.1498 0.1377 0.1481 0.1430 0.1415 0.1415 0.1481 0.1469 0.1614 0.1456 0.1458 0.1605 0.1620 0.1254 0.1452 0.1447 0.1597 0.1606 0.1630 0.1817
va: 3.6428 3.8102 3.4898 3.9038 3.8813 3.8737 3.9112 3.8665 3.9409 3.9331 3.8842 3.8666 3.8785 3.9248 3.9081 3.7672 3.6867 3.9286 3.9586 3.9067 3.8997 3.8841 0.9868 1.0019 0.9997 1.0022 1.0010 0.9949 0.9936 0.9915 1.0044 1.0034 0.9892 1.0042 0.9985 0.9917 0.9887 1.0165 1.0073 1.0113 0.9918 0.9913 0.9883 0.9913
dispersion: -0.019252609 hartree
energy: -868.159690378008 hartree
dipole: 4.03305 -1.39276 2.64029 -6.41095 5.58428 -0.82667 -3.00216 2.13055 -0.87161
magnitude: 2.90072 au
magnitude: 7.37305 debye
