program: Orca
programVersion: 5.0.2
elementType: Cl Cl N N N C C C C C C C C C C C C C H H H H H H H H H H H H H H H H
charge: 1
multiplicity: 1
keywords: wb97x-d3
keywords: def2-TZVPP
keywords: def2/J RIJCOSX
keywords: DEFGRID2
keywords: scfconv7
keywords: smallprint printgap noloewdin
keywords: NOSOSCF
formula: C13H16Cl2N3
InChI: InChI=1/C13H16Cl2N3/c1-2-3-10(7-18-9-16-8-17-18)12-5-4-11(14)6-13(12)15/h4-6,8-10,17H,2-3,7H2,1H3
34 atoms
Cl -0.363229 -0.201603 2.129011
Cl 4.051566 -1.623066 -0.510861
N  -2.341174 -0.720432 -0.5706
N  -3.137247 -0.988506 0.472204
N  -1.992518 -2.789855 0.060114
C  -1.133751 1.446044 -0.389125
C  -1.073065 2.845249 -1.013396
C  -2.181231 0.613346 -1.143377
C  0.182615 0.708916 -0.381495
C  -0.054986 3.770665 -0.352148
C  0.60627 -0.071014 0.693233
C  1.009865 0.726412 -1.504303
C  -0.286618 3.980683 1.137061
C  1.793287 -0.786548 0.670908
C  2.195926 0.018329 -1.560523
C  -1.650187 -1.832738 -0.785619
C  2.585352 -0.738166 -0.46407
C  -2.906481 -2.246124 0.833429
H  -1.479728 1.566665 0.639777
H  -0.866443 2.778771 -2.085807
H  -2.068049 3.295215 -0.93291
H  -1.891224 0.464153 -2.183369
H  -3.159325 1.097688 -1.151453
H  0.95603 3.392121 -0.518113
H  -0.10157 4.732791 -0.865643
H  0.729501 1.32251 -2.364064
H  -1.297192 4.340937 1.339501
H  0.404907 4.723382 1.53185
H  -0.131565 3.068998 1.716834
H  2.095052 -1.372893 1.527407
H  2.818081 0.059968 -2.44338
H  -0.912746 -1.913679 -1.570102
H  -3.42377 -2.729024 1.648501
H  -3.756806 -0.294151 0.866998
totalener: -1589.50163435 hartree
nucrepener: 1628.67433929 hartree
electener: -3218.17597364 hartree
oneelecener: -5393.97913703 hartree
twoeener: 2175.80316339 hartree
kineticenergy: 1585.24233607 hartree
xcener: -108.736330341904 hartree
chargesum: 1.0000000
charge: -0.063086 -0.006656 0.092061 -0.058222 -0.256968 0.026774 -0.199500 -0.174473 0.020008 -0.090777 -0.005721 -0.226801 -0.258264 -0.074263 -0.116399 0.138155 0.053751 0.182586 0.098274 0.090992 0.097880 0.143277 0.142002 0.080585 0.092053 0.142700 0.086941 0.109465 0.067686 0.134591 0.145216 0.184980 0.191609 0.209541
qa: -0.0631 -0.0067 0.0921 -0.0582 -0.2570 0.0268 -0.1995 -0.1745 0.0200 -0.0908 -0.0057 -0.2268 -0.2583 -0.0743 -0.1164 0.1382 0.0538 0.1826 0.0983 0.0910 0.0979 0.1433 0.1420 0.0806 0.0921 0.1427 0.0869 0.1095 0.0677 0.1346 0.1452 0.1850 0.1916 0.2095
va: 1.2710 1.2990 3.3163 3.4763 3.0461 3.7154 3.9543 3.8104 3.2678 3.8824 3.9663 3.9839 3.9329 4.0045 4.0493 4.0301 4.0456 3.9593 1.0339 1.0084 1.0068 0.9998 1.0057 1.0080 1.0087 1.0042 1.0029 1.0102 1.0039 1.0138 1.0070 0.9837 0.9779 0.9975
dispersion: -0.019838563 hartree
energy: -1589.521472916637 hartree
dipole: -16.45789 12.43936 -4.01852 25.51292 -25.40283 0.11009 -6.75077 6.14002 -0.61075
magnitude: 4.06616 au
magnitude: 10.33536 debye
