program: Orca
programVersion: 5.0.2
elementType: Cl Cl N N N C C C C C C C C C C C C C H H H H H H H H H H H H H H H H
charge: 1
multiplicity: 1
keywords: wb97x-d3
keywords: def2-TZVPP
keywords: def2/J RIJCOSX
keywords: DEFGRID2
keywords: scfconv7
keywords: smallprint printgap noloewdin
keywords: NOSOSCF
formula: C13H16Cl2N3
InChI: InChI=1/C13H16Cl2N3/c1-2-3-10(7-18-9-16-8-17-18)12-5-4-11(14)6-13(12)15/h4-6,8-10,17H,2-3,7H2,1H3
34 atoms
Cl 0.105841 -0.009192 -2.471929
Cl 4.054174 -1.449721 0.804606
N  -2.516154 -0.702936 0.038618
N  -1.8933 -1.755419 -0.501505
N  -2.882491 -2.451831 1.305527
C  -1.205205 1.424538 0.070037
C  -1.050945 2.737035 -0.715583
C  -2.403971 0.651594 -0.498747
C  0.080395 0.636384 0.190914
C  -0.026459 3.699144 -0.122574
C  0.771176 0.029145 -0.856433
C  0.680375 0.544476 1.446969
C  -0.386889 4.216432 1.262444
C  1.984873 -0.614426 -0.684671
C  1.890263 -0.091701 1.657334
C  -3.102183 -1.159734 1.137442
C  2.547429 -0.66624 0.58121
C  -2.130855 -2.800579 0.281549
H  -1.486014 1.689843 1.093583
H  -0.786873 2.516382 -1.751449
H  -2.026642 3.234617 -0.74764
H  -2.383655 0.575521 -1.583963
H  -3.329994 1.162622 -0.237553
H  0.959888 3.229033 -0.105236
H  0.061457 4.545411 -0.806213
H  0.187674 1.00496 2.294333
H  0.329521 4.966681 1.593283
H  -0.38689 3.43056 2.020036
H  -1.373051 4.683549 1.269723
H  2.491196 -1.062532 -1.528433
H  2.322432 -0.131505 2.6472
H  -3.689532 -0.528636 1.787051
H  -1.749106 -3.78867 0.075532
H  -1.342463 -1.65974 -1.35161
totalener: -1589.50294778 hartree
nucrepener: 1611.82778919 hartree
electener: -3201.33073696 hartree
oneelecener: -5359.81209180 hartree
twoeener: 2158.48135484 hartree
kineticenergy: 1585.23589017 hartree
xcener: -108.732777149067 hartree
chargesum: 1.0000000
charge: -0.055697 -0.004297 0.098100 -0.062806 -0.270907 0.068190 -0.187381 -0.251377 -0.031726 -0.101445 -0.085903 -0.131208 -0.257405 -0.060805 -0.117411 0.152756 0.054215 0.180697 0.089838 0.108344 0.097823 0.170184 0.140946 0.077516 0.096104 0.130645 0.110557 0.061278 0.089404 0.136881 0.144311 0.180257 0.192281 0.238043
qa: -0.0557 -0.0043 0.0981 -0.0628 -0.2709 0.0682 -0.1874 -0.2514 -0.0317 -0.1014 -0.0859 -0.1312 -0.2574 -0.0608 -0.1174 0.1528 0.0542 0.1807 0.0898 0.1083 0.0978 0.1702 0.1409 0.0775 0.0961 0.1306 0.1106 0.0613 0.0894 0.1369 0.1443 0.1803 0.1923 0.2380
va: 1.2953 1.3019 3.3502 3.4579 3.0694 3.6365 3.9360 3.8553 3.3728 3.8787 3.9648 3.9595 3.9275 3.9671 4.0464 3.9986 4.0407 3.9583 1.0148 1.0153 1.0077 0.9861 1.0092 1.0076 1.0083 1.0013 1.0089 1.0038 1.0038 1.0108 1.0070 0.9854 0.9777 1.0188
dispersion: -0.018991675 hartree
energy: -1589.521939451812 hartree
dipole: -17.27905 14.35072 -2.92834 24.02383 -24.58683 -0.56300 6.51707 -6.68264 -0.16557
magnitude: 2.98656 au
magnitude: 7.59123 debye
