program: Orca
programVersion: 5.0.2
elementType: Cl Cl N N N C C C C C C C C C C C C C H H H H H H H H H H H H H H H H
charge: 1
multiplicity: 1
keywords: wb97x-d3
keywords: def2-TZVPP
keywords: def2/J RIJCOSX
keywords: DEFGRID2
keywords: scfconv7
keywords: smallprint printgap noloewdin
keywords: NOSOSCF
formula: C13H16Cl2N3
InChI: InChI=1/C13H16Cl2N3/c1-2-3-10(7-18-9-16-8-17-18)12-5-4-11(14)6-13(12)15/h4-6,8-10,17H,2-3,7H2,1H3
34 atoms
Cl 0.831737 0.315214 2.897153
Cl 4.197439 -2.118129 -0.454095
N  -2.379973 -0.392099 -0.126322
N  -1.693865 -1.408633 -0.663325
N  -3.658289 -1.393563 -1.598711
C  -0.66768 1.349658 0.424751
C  -1.05042 2.235083 -0.762223
C  -1.84269 0.488027 0.911774
C  0.56705 0.499561 0.197474
C  -2.156804 3.242214 -0.459576
C  1.294208 -0.032449 1.268071
C  1.03625 0.203265 -1.083456
C  -2.406043 4.185909 -1.626911
C  2.408913 -0.833443 1.078751
C  2.146681 -0.596218 -1.299903
C  -3.569378 -0.415667 -0.713301
C  2.827143 -1.120522 -0.211395
C  -2.486952 -1.992094 -1.556175
H  -0.459105 2.012808 1.270429
H  -0.157537 2.783173 -1.073085
H  -1.343617 1.632602 -1.629618
H  -2.679958 1.108642 1.225338
H  -1.567164 -0.130685 1.765568
H  -3.095355 2.732274 -0.216623
H  -1.890882 3.820141 0.429979
H  0.537241 0.62229 -1.947351
H  -1.512446 4.762636 -1.866109
H  -3.200352 4.893923 -1.396716
H  -2.699692 3.642792 -2.52622
H  2.951019 -1.22101 1.930101
H  2.48877 -0.795278 -2.305936
H  -4.350137 0.288691 -0.469343
H  -2.180973 -2.841398 -2.147859
H  -0.71478 -1.558876 -0.439506
totalener: -1589.50266070 hartree
nucrepener: 1577.55284988 hartree
electener: -3167.05551058 hartree
oneelecener: -5291.09547762 hartree
twoeener: 2124.03996704 hartree
kineticenergy: 1585.22281476 hartree
xcener: -108.732265647319 hartree
chargesum: 1.0000000
charge: -0.022982 -0.001865 0.072437 -0.045939 -0.271164 0.098414 -0.186250 -0.218694 -0.067932 -0.099613 -0.014079 -0.236005 -0.252351 -0.104464 -0.125170 0.170624 0.062787 0.177983 0.116069 0.126108 0.053686 0.140498 0.184018 0.040649 0.090882 0.147644 0.091561 0.103817 0.076578 0.136613 0.148529 0.178269 0.192582 0.236760
qa: -0.0230 -0.0019 0.0724 -0.0459 -0.2712 0.0984 -0.1862 -0.2187 -0.0679 -0.0996 -0.0141 -0.2360 -0.2524 -0.1045 -0.1252 0.1706 0.0628 0.1780 0.1161 0.1261 0.0537 0.1405 0.1840 0.0406 0.0909 0.1476 0.0916 0.1038 0.0766 0.1366 0.1485 0.1783 0.1926 0.2368
va: 1.3175 1.3045 3.3555 3.4579 3.0718 3.7049 3.8768 3.8430 3.4379 3.8958 4.1044 3.8890 3.9740 4.0051 4.0579 3.9846 4.0312 3.9574 1.0167 1.0086 1.0112 0.9915 1.0118 1.0081 1.0077 1.0049 1.0047 1.0063 1.0009 1.0165 1.0078 0.9849 0.9780 0.9892
dispersion: -0.018160800 hartree
energy: -1589.520821504843 hartree
dipole: -25.57412 22.93889 -2.63522 22.81431 -23.15362 -0.33931 -12.00698 11.37421 -0.63277
magnitude: 2.73129 au
magnitude: 6.94239 debye
