program: Orca
programVersion: 5.0.2
elementType: Cl Cl N N N C C C C C C C C C C C C C H H H H H H H H H H H H H H H H
charge: 1
multiplicity: 1
keywords: wb97x-d3
keywords: def2-TZVPP
keywords: def2/J RIJCOSX
keywords: DEFGRID2
keywords: scfconv7
keywords: smallprint printgap noloewdin
keywords: NOSOSCF
formula: C13H16Cl2N3
InChI: InChI=1/C13H16Cl2N3/c1-2-3-10(7-18-9-16-8-17-18)12-5-4-11(14)6-13(12)15/h4-6,8-10,17H,2-3,7H2,1H3
34 atoms
Cl 0.563003 0.141314 2.95577
Cl 4.177679 -1.590309 -0.566343
N  -2.476122 -0.748887 -0.146001
N  -1.66135 -1.71115 -0.595181
N  -3.48104 -1.803053 -1.783718
C  -1.061511 1.189199 0.571761
C  -1.564927 2.140434 -0.514535
C  -2.12977 0.15414 0.951082
C  0.262229 0.512052 0.278915
C  -0.682417 3.369508 -0.710332
C  1.055975 -0.010216 1.305332
C  0.742225 0.353534 -1.021808
C  -1.223817 4.301364 -1.784116
C  2.256867 -0.657047 1.056754
C  1.936276 -0.290466 -1.298212
C  -3.573253 -0.836227 -0.886677
C  2.693499 -0.795768 -0.251212
C  -2.290447 -2.329538 -1.589479
H  -0.938435 1.781315 1.484412
H  -1.696708 1.622988 -1.471407
H  -2.565967 2.48071 -0.228102
H  -3.061017 0.648553 1.226167
H  -1.824721 -0.457027 1.800924
H  -0.608543 3.905712 0.239557
H  0.336981 3.070059 -0.963725
H  0.181015 0.759195 -1.853457
H  -0.585832 5.175887 -1.89915
H  -2.22483 4.658147 -1.538809
H  -1.277245 3.807531 -2.755509
H  2.850284 -1.036693 1.876905
H  2.283812 -0.38288 -2.317656
H  -4.423131 -0.186544 -0.74187
H  -1.855017 -3.149879 -2.139363
H  -0.714928 -1.807639 -0.242912
totalener: -1589.50270459 hartree
nucrepener: 1585.52931572 hartree
electener: -3175.03202031 hartree
oneelecener: -5307.14672346 hartree
twoeener: 2132.11470315 hartree
kineticenergy: 1585.22398151 hartree
xcener: -108.731937006539 hartree
chargesum: 1.0000000
charge: -0.020928 -0.001638 0.067093 -0.042308 -0.269893 0.157708 -0.240835 -0.184740 -0.088784 -0.097689 -0.037197 -0.259773 -0.251291 -0.097630 -0.098797 0.165943 0.051382 0.180298 0.116495 0.066183 0.101832 0.132489 0.179068 0.080185 0.086309 0.150715 0.105346 0.082525 0.076724 0.137730 0.148673 0.179752 0.192424 0.232629
qa: -0.0209 -0.0016 0.0671 -0.0423 -0.2699 0.1577 -0.2408 -0.1847 -0.0888 -0.0977 -0.0372 -0.2598 -0.2513 -0.0976 -0.0988 0.1659 0.0514 0.1803 0.1165 0.0662 0.1018 0.1325 0.1791 0.0802 0.0863 0.1507 0.1053 0.0825 0.0767 0.1377 0.1487 0.1798 0.1924 0.2326
va: 1.3206 1.3042 3.3673 3.4676 3.0682 3.6013 3.9014 3.8112 3.4064 3.8907 4.0994 3.8683 3.9543 3.9837 4.0257 3.9841 4.0363 3.9528 1.0150 1.0072 1.0079 1.0063 1.0114 1.0089 1.0040 1.0032 1.0073 1.0026 1.0024 1.0160 1.0065 0.9859 0.9776 0.9867
dispersion: -0.018354785 hartree
energy: -1589.521059375579 hartree
dipole: -21.62399 18.85842 -2.76557 21.72441 -22.52408 -0.79967 -11.85293 11.36540 -0.48753
magnitude: 2.91985 au
magnitude: 7.42167 debye
