program: Orca
programVersion: 5.0.2
elementType: Cl Cl N N N C C C C C C C C C C C C C H H H H H H H H H H H H H H H H
charge: 1
multiplicity: 1
keywords: wb97x-d3
keywords: def2-TZVPP
keywords: def2/J RIJCOSX
keywords: DEFGRID2
keywords: scfconv7
keywords: smallprint printgap noloewdin
keywords: NOSOSCF
formula: C13H16Cl2N3
InChI: InChI=1/C13H16Cl2N3/c1-2-3-10(7-18-9-16-8-17-18)12-5-4-11(14)6-13(12)15/h4-6,8-10,17H,2-3,7H2,1H3
34 atoms
Cl 0.31542 -0.192279 -2.15914
Cl -4.076188 -1.614716 0.524657
N  2.345087 -0.719537 0.590883
N  3.131367 -0.956438 -0.463841
N  2.024084 -2.784624 -0.060443
C  1.133036 1.429581 0.381095
C  1.072644 2.830782 0.99867
C  2.158976 0.604322 1.1668
C  -0.192525 0.707924 0.3648
C  0.062687 3.766091 0.34377
C  -0.632791 -0.061509 -0.709755
C  -1.007493 0.720552 1.496812
C  0.293571 3.982827 -1.144157
C  -1.822955 -0.775066 -0.679548
C  -2.197564 0.02004 1.563355
C  1.67494 -1.841167 0.801853
C  -2.595297 -0.725483 0.465344
C  2.925331 -2.205478 -0.836049
H  1.505177 1.534564 -0.63987
H  0.864367 2.760777 2.069461
H  2.072155 3.266682 0.915392
H  1.840195 0.447256 2.196254
H  3.128802 1.099676 1.185973
H  -0.952428 3.395844 0.508482
H  0.117563 4.727417 0.85962
H  -0.699093 1.291569 2.36298
H  1.308552 4.334269 -1.340744
H  -0.395071 4.730268 -1.539589
H  0.142493 3.070112 -1.723296
H  -2.133385 -1.359815 -1.534242
H  -2.800862 0.054408 2.459577
H  0.957398 -1.94029 1.601419
H  3.450374 -2.657966 -1.661495
H  3.754652 -0.245307 -0.837128
elementType: Cl N C H
totalener: -1589.60045435 hartree
nucrepener: 1626.32603053 hartree
electener: -3215.92648489 hartree
oneelecener: -5388.55728119 hartree
twoeener: 2172.63079631 hartree
cpcmener: -0.11801559 hartree
kineticenergy: 1585.22240814 hartree
xcener: -108.731638398796 hartree
chargesum: 1.0000000
charge: -0.086278 -0.084145 0.082650 -0.035289 -0.353834 0.067211 -0.197735 -0.072504 -0.017426 -0.092723 0.018802 -0.190834 -0.273298 -0.105340 -0.148877 0.141576 0.091823 0.187352 0.108857 0.092489 0.097164 0.145455 0.146154 0.067668 0.074955 0.152150 0.086084 0.094642 0.070936 0.125671 0.147588 0.199156 0.203860 0.256040
qa: -0.0863 -0.0841 0.0827 -0.0353 -0.3538 0.0672 -0.1977 -0.0725 -0.0174 -0.0927 0.0188 -0.1908 -0.2733 -0.1053 -0.1489 0.1416 0.0918 0.1874 0.1089 0.0925 0.0972 0.1455 0.1462 0.0677 0.0750 0.1521 0.0861 0.0946 0.0709 0.1257 0.1476 0.1992 0.2039 0.2560
va: 1.2369 1.2187 3.3708 3.4825 3.0177 3.7382 3.9388 3.8000 3.4259 3.8853 3.9149 3.9543 3.9291 4.0503 4.0298 4.0102 3.8732 3.9475 1.0210 1.0079 1.0051 0.9957 1.0009 1.0077 1.0078 0.9980 1.0018 1.0055 1.0045 1.0194 1.0034 0.9803 0.9743 0.9640
dispersion: -0.019800157 hartree
energy: -1589.620254507616 hartree
dipole: 16.73751 -11.12341 5.61410 25.40813 -24.94242 0.46571 6.83961 -5.77542 1.06419
magnitude: 5.73302 au
magnitude: 14.57219 debye
