program: Orca
programVersion: 5.0.2
elementType: Cl Cl N N N C C C C C C C C C C C C C H H H H H H H H H H H H H H H H
charge: 1
multiplicity: 1
keywords: wb97x-d3
keywords: def2-TZVPP
keywords: def2/J RIJCOSX
keywords: DEFGRID2
keywords: scfconv7
keywords: smallprint printgap noloewdin
keywords: NOSOSCF
formula: C13H16Cl2N3
InChI: InChI=1/C13H16Cl2N3/c1-2-3-10(7-18-9-16-8-17-18)12-5-4-11(14)6-13(12)15/h4-6,8-10,17H,2-3,7H2,1H3
34 atoms
Cl 0.511566 -0.506443 -2.175795
Cl -4.181105 -1.477007 0.181713
N  2.380063 -0.771132 0.673629
N  1.564284 -1.809731 0.878575
N  3.133403 -2.477547 -0.473222
C  1.155516 1.344207 0.245192
C  1.075987 2.79601 0.723853
C  2.118524 0.579302 1.15685
C  -0.184812 0.649793 0.191176
C  0.199468 3.674735 -0.157755
C  -0.565419 -0.193089 -0.850165
C  -1.087403 0.784812 1.246041
C  0.201978 5.124487 0.300819
C  -1.789183 -0.847014 -0.871795
C  -2.311699 0.142179 1.262093
C  3.311037 -1.203064 -0.161001
C  -2.654126 -0.66762 0.191343
C  2.037924 -2.82564 0.181448
H  1.595499 1.36078 -0.754133
H  0.730934 2.842905 1.760759
H  2.093755 3.196552 0.728931
H  1.741791 0.505212 2.176815
H  3.087283 1.074081 1.191113
H  0.552178 3.613067 -1.191286
H  -0.826602 3.298342 -0.161911
H  -0.828793 1.414657 2.087302
H  -0.423734 5.744958 -0.341486
H  1.209021 5.544969 0.285076
H  -0.17804 5.218515 1.319613
H  -2.053166 -1.4895 -1.700131
H  -2.985663 0.275159 2.096808
H  4.105143 -0.563302 -0.511986
H  1.568911 -3.796051 0.184358
H  0.756497 -1.750589 1.494209
elementType: Cl N C H
totalener: -1589.60026169 hartree
nucrepener: 1606.96989903 hartree
electener: -3196.57016072 hartree
oneelecener: -5349.22662087 hartree
twoeener: 2152.65646015 hartree
cpcmener: -0.11680704 hartree
kineticenergy: 1585.22812126 hartree
xcener: -108.730805709534 hartree
chargesum: 1.0000000
charge: -0.082275 -0.083834 0.072501 -0.026827 -0.353841 0.129349 -0.203982 -0.069533 -0.112000 -0.065750 0.038408 -0.165122 -0.285871 -0.114012 -0.150516 0.159875 0.096771 0.186813 0.094166 0.086058 0.093815 0.157566 0.134053 0.066029 0.067281 0.151659 0.091519 0.080590 0.081465 0.123668 0.147879 0.195198 0.203285 0.255616
qa: -0.0823 -0.0838 0.0725 -0.0268 -0.3538 0.1293 -0.2040 -0.0695 -0.1120 -0.0658 0.0384 -0.1651 -0.2859 -0.1140 -0.1505 0.1599 0.0968 0.1868 0.0942 0.0861 0.0938 0.1576 0.1341 0.0660 0.0673 0.1517 0.0915 0.0806 0.0815 0.1237 0.1479 0.1952 0.2033 0.2556
va: 1.2455 1.2190 3.3866 3.4864 3.0233 3.7183 3.9393 3.8042 3.4826 3.8463 3.9173 3.9448 3.9518 4.0495 4.0336 3.9942 3.8557 3.9489 1.0390 1.0055 1.0077 0.9913 1.0041 1.0082 1.0077 0.9981 1.0035 1.0007 0.9996 1.0206 1.0033 0.9823 0.9749 0.9616
dispersion: -0.018952943 hartree
energy: -1589.619214637516 hartree
dipole: 14.59554 -11.25014 3.34540 27.57550 -28.23088 -0.65538 11.04082 -8.26709 2.77373
magnitude: 4.39486 au
magnitude: 11.17086 debye
