program: Orca
programVersion: 5.0.2
elementType: Cl Cl N N N C C C C C C C C C C C C C H H H H H H H H H H H H H H H H
charge: 1
multiplicity: 1
keywords: wb97x-d3
keywords: def2-TZVPP
keywords: def2/J RIJCOSX
keywords: DEFGRID2
keywords: scfconv7
keywords: smallprint printgap noloewdin
keywords: NOSOSCF
formula: C13H16Cl2N3
InChI: InChI=1/C13H16Cl2N3/c1-2-3-10(7-18-9-16-8-17-18)12-5-4-11(14)6-13(12)15/h4-6,8-10,17H,2-3,7H2,1H3
34 atoms
Cl -0.606303 0.517914 -3.005999
Cl -3.920197 -1.846318 0.454186
N  2.37378 -0.656327 0.162416
N  1.664083 -1.788127 0.210537
N  2.836122 -1.685272 2.039173
C  1.095233 1.352746 -0.568317
C  1.506051 2.325337 0.536433
C  2.210946 0.345544 -0.883619
C  -0.200754 0.618162 -0.31694
C  0.515392 3.462406 0.749862
C  -1.011148 0.163529 -1.356814
C  -0.596087 0.276924 0.975593
C  0.988298 4.431983 1.821876
C  -2.154738 -0.588983 -1.136523
C  -1.730542 -0.473527 1.231677
C  3.06716 -0.61831 1.288731
C  -2.502027 -0.902467 0.165353
C  1.959436 -2.392317 1.344879
H  0.99769 1.939314 -1.485486
H  1.676183 1.808252 1.485817
H  2.473742 2.747978 0.251799
H  3.170193 0.850799 -0.978781
H  2.025216 -0.188056 -1.814715
H  0.371912 3.9953 -0.194404
H  -0.463833 3.06477 1.027527
H  0.00172 0.597655 1.818948
H  1.098889 3.931973 2.785806
H  0.282773 5.252309 1.956372
H  1.955474 4.867813 1.565425
H  -2.759487 -0.924564 -1.967649
H  -2.000641 -0.719268 2.249228
H  3.741558 0.190234 1.521357
H  1.526248 -3.338004 1.627629
H  1.030551 -2.057836 -0.538445
elementType: Cl N C H
totalener: -1589.59950984 hartree
nucrepener: 1600.61110489 hartree
electener: -3190.21061474 hartree
oneelecener: -5336.07584569 hartree
twoeener: 2145.86523096 hartree
cpcmener: -0.11798504 hartree
kineticenergy: 1585.21651932 hartree
xcener: -108.729526808705 hartree
chargesum: 1.0000000
charge: -0.079583 -0.084176 0.074327 -0.026734 -0.363491 0.176793 -0.226964 -0.074950 -0.104908 -0.079009 0.008731 -0.158004 -0.288010 -0.130222 -0.154535 0.161437 0.099616 0.196023 0.087473 0.082867 0.098264 0.140515 0.155037 0.069336 0.070520 0.156894 0.082167 0.092211 0.081398 0.124564 0.148204 0.204497 0.204195 0.255515
qa: -0.0796 -0.0842 0.0743 -0.0267 -0.3635 0.1768 -0.2270 -0.0749 -0.1049 -0.0790 0.0087 -0.1580 -0.2880 -0.1302 -0.1545 0.1614 0.0996 0.1960 0.0875 0.0829 0.0983 0.1405 0.1550 0.0693 0.0705 0.1569 0.0822 0.0922 0.0814 0.1246 0.1482 0.2045 0.2042 0.2555
va: 1.2501 1.2185 3.3841 3.5012 3.0416 3.6918 3.9516 3.8025 3.5499 3.8595 3.9840 3.8413 3.9467 4.0804 4.0435 3.9856 3.8575 3.9430 1.0269 1.0021 1.0073 1.0052 1.0036 1.0086 1.0081 0.9959 0.9996 1.0039 1.0006 1.0207 1.0031 0.9755 0.9737 0.9605
dispersion: -0.019155331 hartree
energy: -1589.618665174253 hartree
dipole: 20.78854 -16.84585 3.94269 21.83970 -23.17223 -1.33252 12.21771 -12.21826 -0.00055
magnitude: 4.16178 au
magnitude: 10.57841 debye
