program: Orca
programVersion: 5.0.2
elementType: Cl Cl O O N C C C C C C C C C C C C C C C C H H H H H H H H H H H H H H H H H H H H H H
charge: 1
multiplicity: 1
keywords: wb97x-d3
keywords: def2-TZVPP
keywords: def2/J RIJCOSX
keywords: DEFGRID2
keywords: scfconv7
keywords: smallprint printgap noloewdin
keywords: NOSOSCF
formula: C16H22Cl2NO2
InChI: InChI=1/C16H22Cl2NO2/c1-12-5-2-3-8-19(12)9-4-10-21-16(20)13-6-7-14(17)15(18)11-13/h6-7,11-12,19H,2-5,8-10H2,1H3
43 atoms
Cl 3.650488 1.985085 -1.67888
Cl 4.48823 -0.074639 0.537096
O  -1.911694 1.475152 1.144063
O  -1.40006 2.956306 -0.452689
N  -2.511356 -1.176838 -0.107006
C  -2.469806 -2.633468 0.312931
C  -1.044464 -3.154953 0.165846
C  -1.984144 -0.998015 -1.498323
C  -0.481214 -2.976579 -1.233842
C  -0.569371 -1.517007 -1.63971
C  -3.876849 -0.572444 0.037434
C  -2.960874 -2.812776 1.738883
C  -3.946754 0.940083 -0.110838
C  -3.32103 1.729518 1.023272
C  -1.072219 2.09611 0.324501
C  0.312396 1.576433 0.448842
C  1.239471 1.987896 -0.50105
C  0.687372 0.662544 1.430512
C  2.525533 1.480613 -0.481523
C  1.976156 0.162933 1.455228
C  2.896915 0.564532 0.498809
H  -3.131861 -3.150637 -0.386617
H  -1.058069 -4.210191 0.442409
H  -0.403371 -2.649801 0.897298
H  -2.031795 0.060087 -1.742139
H  -2.672208 -1.530092 -2.156618
H  -1.043181 -3.59374 -1.940678
H  0.553808 -3.319512 -1.266649
H  0.108584 -0.910757 -1.031564
H  -0.269492 -1.372661 -2.678817
H  -4.503649 -1.058681 -0.709795
H  -4.253072 -0.846157 1.019307
H  -2.723975 -3.827125 2.058749
H  -2.457094 -2.128752 2.424953
H  -4.036386 -2.692103 1.849733
H  -3.582854 1.282411 -1.080038
H  -5.01246 1.182026 -0.1006
H  -3.738414 1.421992 1.981642
H  -3.509802 2.796435 0.901519
H  0.958616 2.696938 -1.268207
H  -0.010476 0.330166 2.186087
H  2.268679 -0.543922 2.219552
H  -1.878777 -0.682465 0.528634
elementType: Cl O N C H
totalener: -1748.55826420 hartree
nucrepener: 2079.57588125 hartree
electener: -3828.13414546 hartree
oneelecener: -6506.80399257 hartree
twoeener: 2678.66984711 hartree
cpcmener: -0.10096562 hartree
kineticenergy: 1743.36614411 hartree
xcener: -123.760200674443 hartree
chargesum: 1.0000000
charge: -0.052570 -0.046737 -0.297457 -0.434099 0.187229 0.070560 -0.195830 -0.148149 -0.095295 -0.117602 -0.110073 -0.308873 -0.155017 0.017168 0.501811 0.007075 -0.142185 -0.236413 0.066825 -0.081606 0.041802 0.117869 0.096600 0.092732 0.136762 0.143572 0.081624 0.082918 0.054329 0.099643 0.137659 0.142468 0.108206 0.110216 0.105898 0.103150 0.107225 0.115535 0.120330 0.125890 0.151728 0.147096 0.147987
qa: -0.0526 -0.0467 -0.2975 -0.4341 0.1872 0.0706 -0.1958 -0.1481 -0.0953 -0.1176 -0.1101 -0.3089 -0.1550 0.0172 0.5018 0.0071 -0.1422 -0.2364 0.0668 -0.0816 0.0418 0.1179 0.0966 0.0927 0.1368 0.1436 0.0816 0.0829 0.0543 0.0996 0.1377 0.1425 0.1082 0.1102 0.1059 0.1032 0.1072 0.1155 0.1203 0.1259 0.1517 0.1471 0.1480
va: 1.2641 1.2742 2.1134 2.0725 3.6226 3.7502 3.9359 3.8773 3.8723 3.9205 3.8466 3.9557 3.9138 3.8411 4.0704 3.5684 4.0791 4.0139 3.9606 3.9285 3.9762 1.0084 1.0172 1.0068 1.0010 1.0039 1.0117 1.0135 1.0365 1.0141 1.0042 0.9936 1.0038 0.9991 1.0025 1.0193 1.0163 1.0011 1.0113 1.0404 1.0152 1.0049 1.0497
dispersion: -0.025807967 hartree
energy: -1748.584072170062 hartree
dipole: -51.46511 45.73752 -5.72759 -26.97386 23.43106 -3.54280 3.83331 -2.94869 0.88462
magnitude: 6.79259 au
magnitude: 17.26540 debye
