program: Orca
programVersion: 5.0.2
elementType: Cl Cl O O N C C C C C C C C C C C C C C C C H H H H H H H H H H H H H H H H H H H H H H
charge: 1
multiplicity: 1
keywords: wb97x-d3
keywords: def2-TZVPP
keywords: def2/J RIJCOSX
keywords: DEFGRID2
keywords: scfconv7
keywords: smallprint printgap noloewdin
keywords: NOSOSCF
formula: C16H22Cl2NO2
InChI: InChI=1/C16H22Cl2NO2/c1-12-5-2-3-8-19(12)9-4-10-21-16(20)13-6-7-14(17)15(18)11-13/h6-7,11-12,19H,2-5,8-10H2,1H3
43 atoms
Cl 3.528855 0.348358 2.354856
Cl 4.405223 0.292408 -0.660594
O  -1.98784 1.85231 -0.136172
O  -1.445727 2.190306 2.010683
N  -2.564205 -0.994244 -0.735808
C  -2.047197 -2.132403 0.115202
C  -0.63286 -2.480908 -0.329384
C  -2.532084 -1.357063 -2.189986
C  -0.555804 -2.843683 -1.803044
C  -1.134755 -1.718214 -2.642159
C  -3.938167 -0.510229 -0.353129
C  -2.091657 -1.808333 1.59476
C  -3.98378 0.653788 0.624973
C  -3.401901 1.960129 0.119999
C  -1.134625 1.91232 0.878273
C  0.243769 1.555838 0.460435
C  1.151165 1.207331 1.453746
C  0.629772 1.512759 -0.876503
C  2.430099 0.806363 1.113744
C  1.915227 1.131831 -1.2139
C  2.816713 0.77267 -0.223186
H  -2.721668 -2.965097 -0.100888
H  -0.294176 -3.312477 0.29013
H  0.029898 -1.63509 -0.110208
H  -2.909999 -0.496489 -2.739242
H  -3.229973 -2.184968 -2.321519
H  -1.115377 -3.765642 -1.984396
H  0.47893 -3.037063 -2.088506
H  -0.493309 -0.833854 -2.579579
H  -1.189775 -1.994439 -3.6960
H  -4.433116 -0.216483 -1.277414
H  -4.480075 -1.367522 0.043281
H  -1.512292 -0.915435 1.835011
H  -3.103956 -1.689934 1.975566
H  -1.64498 -2.643514 2.133449
H  -5.045587 0.839303 0.803297
H  -3.561551 0.393652 1.594306
H  -3.600593 2.766809 0.8252
H  -3.833421 2.234178 -0.841321
H  0.860335 1.230037 2.495145
H  -0.054686 1.782335 -1.667919
H  2.218048 1.110277 -2.251536
H  -1.909599 -0.215968 -0.627146
elementType: Cl O N C H
totalener: -1748.55121779 hartree
nucrepener: 2093.44164296 hartree
electener: -3841.99286075 hartree
oneelecener: -6534.33526888 hartree
twoeener: 2692.34240814 hartree
cpcmener: -0.11448518 hartree
kineticenergy: 1743.37055581 hartree
xcener: -123.760332031669 hartree
chargesum: 1.0000000
charge: -0.059492 -0.053466 -0.288757 -0.461321 0.185258 0.066507 -0.170938 -0.084763 -0.095731 -0.162675 -0.084847 -0.317150 -0.160386 0.018566 0.518469 0.022230 -0.142650 -0.241182 0.060439 -0.091048 0.052948 0.108914 0.095909 0.073806 0.122136 0.139230 0.079331 0.079787 0.087990 0.095338 0.123212 0.132975 0.098640 0.110222 0.114706 0.107920 0.110187 0.119258 0.117642 0.125751 0.156788 0.148587 0.141661
qa: -0.0595 -0.0535 -0.2888 -0.4613 0.1853 0.0665 -0.1709 -0.0848 -0.0957 -0.1627 -0.0848 -0.3172 -0.1604 0.0186 0.5185 0.0222 -0.1427 -0.2412 0.0604 -0.0910 0.0529 0.1089 0.0959 0.0738 0.1221 0.1392 0.0793 0.0798 0.0880 0.0953 0.1232 0.1330 0.0986 0.1102 0.1147 0.1079 0.1102 0.1193 0.1176 0.1258 0.1568 0.1486 0.1417
va: 1.2570 1.2666 2.1198 2.0382 3.6174 3.7786 3.9236 3.8384 3.8808 3.9499 3.8683 3.9487 3.8861 3.8383 4.0492 3.5588 4.0664 4.0271 3.9619 3.9353 3.9568 1.0116 1.0170 1.0162 1.0025 0.9984 1.0116 1.0134 1.0121 1.0153 0.9988 1.0004 1.0026 1.0006 1.0071 1.0171 1.0182 1.0110 1.0007 1.0399 1.0130 1.0042 1.0672
dispersion: -0.026424593 hartree
energy: -1748.577642380206 hartree
dipole: -49.75918 43.86966 -5.88952 -18.86845 16.58286 -2.28558 -13.53919 10.54329 -2.99590
magnitude: 6.99183 au
magnitude: 17.77182 debye
