program: Orca
programVersion: 5.0.2
elementType: Cl O N N N C C C C C C C C C C C C C C C C H H H H H H H H H H H H H H H H H H H H H H H
charge: 1
multiplicity: 1
keywords: wb97x-d3
keywords: def2-TZVPP
keywords: def2/J RIJCOSX
keywords: DEFGRID2
keywords: scfconv7
keywords: smallprint printgap noloewdin
keywords: NOSOSCF
formula: C16H23ClN3O
InChI: InChI=1/C16H23ClN3O/c1-15(2,3)16(21,10-20-12-18-11-19-20)9-8-13-4-6-14(17)7-5-13/h4-7,11-12,19,21H,8-10H2,1-3H3
44 atoms
Cl -4.272951 3.339557 -1.296362
O  0.840075 -0.372987 -1.057552
N  1.642957 -2.764389 0.260013
N  0.797465 -3.247652 -0.654151
N  0.584642 -4.471126 1.132754
C  1.675808 -0.281073 0.081547
C  2.664701 0.926975 -0.066315
C  0.866139 -0.189862 1.401999
C  2.477164 -1.590552 0.049219
C  3.610988 0.732609 -1.256778
C  1.867249 2.213456 -0.316176
C  3.513801 1.115632 1.193856
C  -0.60149 -0.636231 1.363276
C  -1.526048 0.346563 0.692113
C  1.488644 -3.523535 1.332204
C  -1.668056 1.638754 1.196948
C  -2.266766 0.00107 -0.435135
C  0.170659 -4.27227 -0.107883
C  -2.508555 2.562311 0.597027
C  -3.114148 0.911838 -1.051962
C  -3.224389 2.189582 -0.530831
H  0.880775 0.833614 1.776697
H  1.383306 -0.766089 2.173408
H  2.986151 -1.729997 -0.903222
H  3.224132 -1.620555 0.839173
H  4.357979 -0.043135 -1.080699
H  4.15933 1.658438 -1.439073
H  3.077274 0.488248 -2.176019
H  1.103817 2.400686 0.440992
H  1.379412 2.218106 -1.292785
H  2.545765 3.06752 -0.303071
H  4.110231 0.234092 1.43487
H  4.213694 1.938513 1.038184
H  2.918478 1.366253 2.071776
H  -0.91983 -0.748309 2.402731
H  -0.73435 -1.618707 0.909978
H  0.236955 0.378726 -1.082156
H  2.059626 -3.365357 2.233146
H  -1.115816 1.93637 2.080494
H  -2.183813 -0.997382 -0.847246
H  -0.571301 -4.847573 -0.637037
H  -2.603459 3.558665 1.007258
H  -3.675276 0.623139 -1.930473
H  0.701811 -2.827927 -1.573991
elementType: Cl O N C H
totalener: -1323.17509075 hartree
nucrepener: 1907.12866305 hartree
electener: -3230.30375381 hartree
oneelecener: -5573.28646852 hartree
twoeener: 2342.98271471 hartree
cpcmener: -0.11975661 hartree
kineticenergy: 1318.47941776 hartree
xcener: -106.544682928571 hartree
chargesum: 1.0000000
charge: -0.104607 -0.450763 0.079828 -0.031468 -0.364148 0.419254 0.206331 -0.275721 -0.167924 -0.369262 -0.375169 -0.353247 -0.076848 0.050683 0.164015 -0.277235 -0.214960 0.193953 -0.127226 -0.138637 0.084799 0.116397 0.121310 0.161189 0.141389 0.098067 0.102075 0.099142 0.107480 0.100289 0.104457 0.101154 0.102770 0.099864 0.111039 0.091632 0.238065 0.193754 0.147777 0.146306 0.203747 0.145903 0.144632 0.249916
qa: -0.1046 -0.4508 0.0798 -0.0315 -0.3641 0.4193 0.2063 -0.2757 -0.1679 -0.3693 -0.3752 -0.3532 -0.0768 0.0507 0.1640 -0.2772 -0.2150 0.1940 -0.1272 -0.1386 0.0848 0.1164 0.1213 0.1612 0.1414 0.0981 0.1021 0.0991 0.1075 0.1003 0.1045 0.1012 0.1028 0.0999 0.1110 0.0916 0.2381 0.1938 0.1478 0.1463 0.2037 0.1459 0.1446 0.2499
va: 1.1999 1.9814 3.3986 3.4885 3.0332 3.6335 3.8182 3.8909 3.8445 3.9136 3.9210 3.9359 3.8093 3.5030 3.9879 3.9890 3.9409 3.9415 3.9564 3.9941 3.8280 1.0036 1.0002 0.9913 0.9972 0.9970 1.0039 1.0223 1.0025 1.0071 1.0076 1.0053 1.0035 1.0027 1.0061 1.0102 1.0168 0.9832 1.0025 1.0029 0.9739 1.0035 1.0047 0.9783
dispersion: -0.026501182 hartree
energy: -1323.201591936384 hartree
dipole: 33.35398 -29.74244 3.61153 -2.11474 -2.29696 -4.41170 6.39504 -6.17988 0.21516
magnitude: 5.70548 au
magnitude: 14.50219 debye
