program: Orca
programVersion: 5.0.2
elementType: Cl O N N N C C C C C C C C C C C C C C C C H H H H H H H H H H H H H H H H H H H H H H H
charge: 1
multiplicity: 1
keywords: wb97x-d3
keywords: def2-TZVPP
keywords: def2/J RIJCOSX
keywords: DEFGRID2
keywords: scfconv7
keywords: smallprint printgap noloewdin
keywords: NOSOSCF
formula: C16H23ClN3O
InChI: InChI=1/C16H23ClN3O/c1-15(2,3)16(21,10-20-12-18-11-19-20)9-8-13-4-6-14(17)7-5-13/h4-7,11-12,19,21H,8-10H2,1-3H3
44 atoms
Cl -5.114471 4.108807 0.979124
O  1.512537 -0.923882 -1.582007
N  1.998037 -3.051865 0.116344
N  2.039977 -3.522897 -1.132697
N  3.272974 -4.831875 0.092925
C  1.492235 -0.578356 -0.208827
C  2.841829 0.10665 0.200147
C  0.290026 0.334816 0.114485
C  1.210745 -1.897738 0.534823
C  2.781938 0.623758 1.640136
C  4.036213 -0.848294 0.085736
C  3.128559 1.297676 -0.726038
C  -1.013026 0.003107 -0.620468
C  -2.074026 0.998993 -0.247026
C  2.749829 -3.868025 0.835146
C  -2.840997 0.833517 0.903044
C  -2.274558 2.143883 -1.013143
C  2.822762 -4.584084 -1.126327
C  -3.779172 1.780335 1.285884
C  -3.207601 3.103104 -0.648156
C  -3.950855 2.912499 0.505037
H  0.548916 1.369639 -0.116879
H  0.105142 0.308834 1.191468
H  1.396676 -1.79241 1.600842
H  0.164887 -2.180056 0.416034
H  2.531799 -0.159693 2.358084
H  2.063246 1.434191 1.763862
H  3.759523 1.015458 1.926583
H  4.065316 -1.580799 0.892408
H  4.961281 -0.274461 0.164245
H  4.0717 -1.374637 -0.869529
H  3.336674 0.988991 -1.752006
H  2.321201 2.030132 -0.750642
H  4.018116 1.819387 -0.370374
H  -1.357181 -1.004367 -0.376472
H  -0.85896 0.034693 -1.699665
H  1.461465 -0.126429 -2.121554
H  2.884966 -3.738095 1.896993
H  -2.706677 -0.050311 1.515121
H  -1.693273 2.293323 -1.915061
H  3.037609 -5.14819 -2.019291
H  -4.367062 1.634779 2.18201
H  -3.349797 3.98463 -1.258771
H  1.592721 -3.021923 -1.896297
elementType: Cl O N C H
totalener: -1323.17592944 hartree
nucrepener: 1821.40092329 hartree
electener: -3144.57685273 hartree
oneelecener: -5402.40533654 hartree
twoeener: 2257.82848381 hartree
cpcmener: -0.11955198 hartree
kineticenergy: 1318.49287363 hartree
xcener: -106.545635338954 hartree
chargesum: 1.0000000
charge: -0.106588 -0.461704 0.075967 -0.018420 -0.369061 0.427708 0.258863 -0.314167 -0.200545 -0.370127 -0.378811 -0.365509 -0.021689 0.025717 0.167634 -0.231032 -0.223168 0.187523 -0.143948 -0.144966 0.083300 0.124251 0.113461 0.141468 0.179910 0.103851 0.100191 0.103152 0.098046 0.108082 0.101562 0.098921 0.109712 0.100320 0.097155 0.083687 0.230367 0.199566 0.145505 0.142882 0.203383 0.143227 0.144570 0.249755
qa: -0.1066 -0.4617 0.0760 -0.0184 -0.3691 0.4277 0.2589 -0.3142 -0.2005 -0.3701 -0.3788 -0.3655 -0.0217 0.0257 0.1676 -0.2310 -0.2232 0.1875 -0.1439 -0.1450 0.0833 0.1243 0.1135 0.1415 0.1799 0.1039 0.1002 0.1032 0.0980 0.1081 0.1016 0.0989 0.1097 0.1003 0.0972 0.0837 0.2304 0.1996 0.1455 0.1429 0.2034 0.1432 0.1446 0.2498
va: 1.1985 1.9394 3.4130 3.4689 3.0460 3.6715 3.7297 3.9456 3.8951 3.9528 3.9299 3.9220 3.7300 3.5888 3.9782 3.9838 3.9829 3.9529 3.9710 3.9692 3.8201 1.0016 0.9993 0.9954 0.9822 1.0012 0.9996 1.0028 0.9981 1.0056 1.0171 1.0079 1.0025 1.0035 1.0166 1.0307 1.0121 0.9799 1.0035 1.0041 0.9738 1.0050 1.0045 0.9934
dispersion: -0.023819213 hartree
energy: -1323.199748656463 hartree
dipole: 33.17974 -29.29372 3.88602 -8.64209 3.90765 -4.73444 -1.64089 0.44687 -1.19402
magnitude: 6.24034 au
magnitude: 15.86167 debye
