program: Orca
programVersion: 5.0.2
elementType: Cl O N N N C C C C C C C C C C C C C C C C H H H H H H H H H H H H H H H H H H H H H H H
charge: 1
multiplicity: 1
keywords: wb97x-d3
keywords: def2-TZVPP
keywords: def2/J RIJCOSX
keywords: DEFGRID2
keywords: scfconv7
keywords: smallprint printgap noloewdin
keywords: NOSOSCF
formula: C16H23ClN3O
InChI: InChI=1/C16H23ClN3O/c1-15(2,3)16(21,10-20-12-18-11-19-20)9-8-13-4-6-14(17)7-5-13/h4-7,11-12,19,21H,8-10H2,1-3H3
44 atoms
Cl -4.797473 0.258918 -1.47803
O  1.523674 0.242542 -1.207908
N  0.693669 -1.539267 0.715828
N  -0.031215 -1.696717 -0.396422
N  -1.0219 -2.818622 1.184241
C  2.190945 0.39898 0.036526
C  3.726915 0.632211 -0.22179
C  1.594746 1.570651 0.83793
C  2.033115 -0.95044 0.756658
C  4.26184 -0.331996 -1.288209
C  3.971415 2.056122 -0.734719
C  4.545761 0.432132 1.057634
C  0.27197 1.394352 1.584182
C  -0.975681 1.117984 0.787098
C  0.072408 -2.23893 1.652303
C  -1.197933 1.658507 -0.477765
C  -1.984143 0.336947 1.345773
C  -1.070429 -2.44489 -0.0852
C  -2.366778 1.400891 -1.177719
C  -3.161383 0.066822 0.663144
C  -3.339054 0.597725 -0.602843
H  1.516252 2.431048 0.168519
H  2.321005 1.866322 1.596197
H  2.702324 -1.699169 0.335426
H  2.26926 -0.853886 1.814271
H  5.337914 -0.183247 -1.392473
H  3.818984 -0.157033 -2.268097
H  4.115567 -1.383817 -1.03777
H  5.017659 2.158514 -1.027692
H  3.775618 2.816536 0.020922
H  3.370283 2.292726 -1.615627
H  4.546761 -0.604582 1.39827
H  5.586024 0.701482 0.867513
H  4.199007 1.054909 1.88338
H  0.115713 2.328962 2.132052
H  0.374676 0.63493 2.362817
H  1.431655 1.100326 -1.638088
H  0.451609 -2.313157 2.659134
H  -0.458011 2.29909 -0.939798
H  -1.849317 -0.079355 2.337179
H  -1.833824 -2.699357 -0.801914
H  -2.513627 1.82538 -2.161792
H  -3.921906 -0.555476 1.115289
H  0.21049 -1.150637 -1.224509
elementType: Cl O N C H
totalener: -1323.17251374 hartree
nucrepener: 1965.06745324 hartree
electener: -3288.23996698 hartree
oneelecener: -5688.14039411 hartree
twoeener: 2399.90042713 hartree
cpcmener: -0.11387084 hartree
kineticenergy: 1318.50549346 hartree
xcener: -106.555453979732 hartree
chargesum: 1.0000000
charge: -0.105131 -0.459898 0.079744 -0.013280 -0.362811 0.450113 0.208563 -0.247665 -0.192148 -0.350914 -0.361571 -0.360356 -0.089908 0.062230 0.147995 -0.251799 -0.240583 0.171587 -0.128736 -0.140593 0.088669 0.102580 0.106069 0.174402 0.142682 0.100977 0.092071 0.097318 0.101173 0.101211 0.101589 0.098343 0.101059 0.106702 0.108251 0.094608 0.237529 0.190489 0.143354 0.153260 0.202760 0.144087 0.145261 0.250716
qa: -0.1051 -0.4599 0.0797 -0.0133 -0.3628 0.4501 0.2086 -0.2477 -0.1921 -0.3509 -0.3616 -0.3604 -0.0899 0.0622 0.1480 -0.2518 -0.2406 0.1716 -0.1287 -0.1406 0.0887 0.1026 0.1061 0.1744 0.1427 0.1010 0.0921 0.0973 0.1012 0.1012 0.1016 0.0983 0.1011 0.1067 0.1083 0.0946 0.2375 0.1905 0.1434 0.1533 0.2028 0.1441 0.1453 0.2507
va: 1.1986 1.9612 3.4107 3.4363 3.0078 3.6091 3.7694 3.9224 3.8731 3.9275 3.9254 3.9423 3.8375 3.5443 3.9992 3.9553 3.8661 3.9622 3.9835 3.9422 3.7952 0.9953 1.0164 0.9850 0.9853 1.0024 1.0181 1.0060 1.0060 0.9983 1.0072 1.0001 1.0037 1.0038 0.9962 1.0047 1.0089 0.9861 1.0080 0.9990 0.9748 1.0049 1.0066 1.0078
dispersion: -0.028560860 hartree
energy: -1323.201074600162 hartree
dipole: 44.98466 -41.79653 3.18813 8.41303 -9.37398 -0.96095 6.03804 -5.28951 0.74853
magnitude: 3.41290 au
magnitude: 8.67491 debye
