program: Gaussian 09
title: 000071135
version: EM64L-G09RevD.01
frameworkgroup: C1[X(C21H28N2O2)]
method: RPBEPBE
basis: SDD
operation: Freq
keyword: #p
keyword: freq=noraman
keyword: PBEPBE/SDD
title: #p freq=noraman PBEPBE/SDD
converged: NO YES NO NO
title: Mulliken charges:
elementType: O O N N C C C C C C C C C C C C C C C C C C C C C H H H H H H H H H H H H H H H H H H H H H H H H H H H H
charge: -0.260531 -0.426831 -0.139868 -0.083408 -0.362564 -0.376279 -0.393010 -0.384225 -0.314391 -0.349814 0.446951 0.467365 -0.271615 -0.435536 -0.455463 -0.372177 -0.347531 -0.225775 -0.224765 -0.247462 -0.241480 -0.245219 -0.244738 -0.240704 -0.317224 0.232197 0.188454 0.191809 0.232444 0.186321 0.208792 0.197106 0.190102 0.194872 0.197842 0.221437 0.188514 0.203090 0.226636 0.228399 0.261691 0.243621 0.222521 0.223639 0.223601 0.224171 0.226925 0.227146 0.178741 0.187691 0.231695 0.177095 0.329739
chargesum: 0.00000
title: Mulliken charges with hydrogens summed into heavy atoms:
elementType: O O N N C C C C C C C C C C C C C C C C C C C C C
charge: -0.260531 -0.097092 -0.139868 -0.083408 0.058087 0.047974 0.002103 0.002983 -0.119518 0.069465 0.446951 0.467365 0.119989 -0.208899 -0.227063 -0.110486 -0.103910 -0.003254 -0.001127 -0.023861 -0.017309 -0.018294 -0.017593 0.125729 0.091566
polarizability: 2.68958454e+02 -5.29974277e+00 2.51281399e+02 -9.57061736e+00 5.19825935e+00 2.09556716e+02
1716.lowfreq: -25.6850 -10.0772 -4.1349 -0.0007 0.0001 0.0008 4.3404 14.9995 22.8099
frequency: -24.6289 13.9159 22.4069 24.8293 46.1447 51.3493 59.3435 67.5369 76.3697 89.6062 91.8464 113.3868 128.0698 170.9134 192.6910 211.8753 227.8285 232.1614 257.8144 266.5174 275.7089 293.2590 326.0903 344.6376 345.7011 401.7848 402.4265 409.4489 419.1994 468.7324 481.3318 487.3530 525.3948 555.5752 605.1211 613.7019 618.2270 627.7166 647.5642 700.3330 711.9174 754.4470 757.8295 769.0278 808.6721 816.8827 830.7197 841.2365 847.1735 848.8110 851.3444 858.0775 862.8091 919.4498 936.7928 950.3402 974.0251 985.8542 989.8589 991.4075 993.6535 994.1082 999.7817 1005.2458 1014.0345 1017.7600 1025.3361 1027.6301 1051.4363 1056.0924 1073.2861 1078.5694 1082.0838 1091.4100 1095.1966 1105.4746 1119.7907 1138.9007 1145.9956 1160.0742 1169.9971 1171.0389 1171.3489 1179.1496 1184.4293 1189.1251 1192.6039 1202.5615 1218.5695 1250.8688 1255.7522 1270.5653 1275.0053 1290.2646 1297.5621 1306.4213 1308.1975 1318.2618 1331.8132 1335.5547 1338.0545 1350.9381 1365.5921 1378.8154 1382.8886 1384.2483 1388.1489 1393.5007 1411.8592 1439.5287 1441.0679 1453.0633 1456.3428 1458.2235 1461.6647 1462.6173 1470.9503 1475.1471 1477.3156 1480.5587 1488.3976 1592.9091 1594.6446 1608.3537 1612.9304 2827.3046 2850.1194 2859.6891 2869.1565 2878.1342 2884.7330 2893.7400 2924.4891 2933.5269 2950.9349 2981.4998 3030.7625 3035.7783 3048.2962 3060.2246 3066.6904 3086.7415 3112.3530 3114.0058 3122.0125 3124.5722 3134.9620 3137.5793 3145.2539 3150.3778 3161.2081 3163.3962 3559.3161
redmass: 3.0770 3.9867 4.1882 4.8938 4.5512 4.0308 3.6541 3.0949 3.7776 3.1963 2.5113 3.9075 2.0223 3.6584 3.8617 3.6308 2.6591 2.9933 2.8980 2.8543 2.7674 3.0389 2.7324 3.0090 3.4701 2.4780 2.7411 2.9015 2.4727 3.2862 3.8872 3.0865 2.6976 3.6548 5.3946 4.8119 6.1274 2.9133 3.4209 1.8071 1.7451 1.7679 2.6816 3.0590 1.5161 2.3116 2.9930 2.4705 2.7553 1.5081 1.5322 2.6022 1.2703 1.4557 1.4891 2.1013 1.3974 1.4521 5.9250 4.5860 2.1319 1.7412 2.2876 1.4307 1.8660 2.5838 2.1168 2.2133 2.1009 2.1479 1.6174 1.8059 1.6664 2.9285 4.0531 2.0959 2.4928 3.0060 2.8785 1.5377 1.0736 1.0977 1.3065 1.1714 1.3118 1.8589 1.2298 1.8988 1.5040 1.1404 1.4295 1.3036 1.5142 1.2885 1.3647 1.2866 1.2651 1.2870 1.2973 1.2806 1.2693 1.3641 1.4230 2.5319 1.4142 6.1604 1.3045 2.1935 1.4995 2.1135 2.1243 1.0810 1.0802 1.0837 1.0844 1.0933 1.0999 1.0969 2.2579 2.2821 1.0817 6.0352 6.1986 6.1515 6.1559 1.0809 1.0710 1.0700 1.0709 1.0695 1.0574 1.0696 1.0569 1.0948 1.0766 1.1024 1.0889 1.0898 1.0916 1.0876 1.0886 1.0928 1.0871 1.0868 1.0860 1.0863 1.0911 1.0918 1.0956 1.0950 1.1013 1.1011 1.0662
irintensity: 8.0732 0.1364 0.2424 0.2956 0.0132 0.7164 0.2850 3.5416 0.1329 6.6550 8.9690 8.1241 60.4491 4.3386 0.3004 22.1410 53.6740 15.7289 0.7387 6.5324 14.7334 2.8121 5.0709 8.7497 1.4946 7.5624 1.7832 0.5326 6.4064 1.7119 1.7886 2.6878 15.5616 6.9692 7.4665 0.3035 3.6051 9.2850 5.8669 31.0836 76.3867 40.8191 33.9116 9.3735 11.8861 22.1961 7.0793 4.1085 0.1237 0.8370 0.2404 21.6990 0.2261 3.1387 9.6772 4.9464 0.0684 1.0662 0.3932 1.5326 69.3937 18.6050 39.5980 1.8244 90.2564 5.5827 13.4758 1.3562 17.2083 40.4576 0.3245 3.2450 27.1789 31.1036 72.6248 5.9890 23.9378 40.0461 63.4139 0.7694 0.0358 2.3497 22.2893 5.1249 3.9950 5.3981 2.1585 1.1505 1.4897 4.4289 4.4183 3.5790 12.5580 17.1239 38.3625 12.4846 3.8101 19.0275 3.4234 5.6733 0.6377 3.7312 0.4770 1.4109 13.3555 0.2900 15.8700 6.3980 1.3186 4.9736 19.8462 0.2580 6.5864 0.9199 2.2202 30.9638 4.2246 2.3821 27.6918 7.9714 5.5841 0.1218 2.3778 12.0150 2.2207 46.1760 67.3447 23.1924 5.0547 171.8486 64.0346 122.6982 68.4263 38.5757 147.1376 49.2917 30.5112 44.4818 44.1410 34.1691 17.5180 23.0817 7.4986 7.8998 0.2540 0.2281 12.9053 29.4017 21.4585 39.4434 33.8808 20.1190 4.8646
temp: 298.150 k
press: 1.00000 atm
elementType: 8 8 7 7 6 6 6 6 6 6 6 6 6 6 6 6 6 6 6 6 6 6 6 6 6 1 1 1 1 1 1 1 1 1 1 1 1 1 1 1 1 1 1 1 1 1 1 1 1 1 1 1 1
symmnumber: 1
zpe: 1177545.1 jmol-1
zpe.correction: 0.448503 hartree
zpe.thermalcorrener: 0.472177 hartree
zpe.thermalcorrenthalpy: 0.473122 hartree
zpe.thermalcorrgfe: 0.391747 hartree
zpe.sumelectzpe: -1075.037247 hartree
zpe.sumelectthermal: -1075.013573 hartree
zpe.sumelectthermalent: -1075.012629 hartree
zpe.sumelectthermalfe: -1075.094004 hartree
dipole: 1.0651 1.4975 -2.7087
dipole: 3.2733
quadrupole: -162.4040 -142.0068 -141.4316
quadrupole: -14.8403 16.8004 3.0770
quadrupole: -13.7899 6.6074 7.1825 -14.8403 16.8004 3.0770
hfenergy: -1075.4857504 hartree
pointgroup: C01 [X(C21H28N2O2)]
dipole: -0.3669368 -0.7411575 -0.9871568 debye
polarizability: 268.8129134|-2.9203129|248.9071561|11.7951247|-10.0378711|212.0765004 unknown
InChI: InChI=1S/C21H28N2O2/c24-16-18-25-17-15-22-11-13-23(14-12-22)21(19-7-3-1-4-8-19)20-9-5-2-6-10-20/h1-10,21,24H,11-18H2
charge 0 multiplicity 1
53 atoms
O  6.003583 0.183431 0.378455
O  8.773159 1.377698 0.254141
N  -0.596633 0.03408 -0.100404
N  2.297372 0.419097 -0.066274
C  0.025304 1.325128 -0.504189
C  0.344519 -1.075538 -0.417761
C  1.359066 1.529396 0.230366
C  1.680376 -0.875894 0.313176
C  -1.942284 -0.188579 -0.712608
C  3.641072 0.625116 0.5227
C  -2.602658 -1.462522 -0.155173
C  -2.875387 1.012238 -0.487143
C  4.721616 -0.129731 -0.264065
C  -3.441632 -2.24188 -0.987551
C  -3.546213 1.606277 -1.582522
C  -2.438671 -1.844693 1.200237
C  -3.110128 1.520643 0.816036
C  -4.112573 -3.376839 -0.478298
C  -4.440597 2.684311 -1.385581
C  -3.10343 -2.980456 1.711265
C  -3.995565 2.60068 1.015811
C  -3.946861 -3.74991 0.875369
C  -4.668377 3.185377 -0.084315
C  7.132934 -0.459006 -0.2865
C  8.430391 -0.039082 0.407092
H  -0.658543 2.152317 -0.252121
H  0.214026 1.353625 -1.606913
H  0.539173 -1.129386 -1.518548
H  -0.10426 -2.032904 -0.103726
H  1.152675 1.614796 1.327538
H  1.81547 2.478379 -0.106896
H  2.363909 -1.70113 0.042414
H  1.498122 -0.930014 1.417375
H  -1.844459 -0.321179 -1.822537
H  3.692152 0.32201 1.596512
H  3.886054 1.701869 0.479788
H  4.54645 -1.228912 -0.248517
H  4.717012 0.207653 -1.322911
H  -3.576274 -1.956375 -2.038722
H  -3.366477 1.226143 -2.596123
H  -1.770432 -1.252256 1.835423
H  -2.588139 1.069881 1.66687
H  -4.759769 -3.969093 -1.135295
H  -4.953065 3.132768 -2.244307
H  -2.964846 -3.266311 2.760454
H  -4.166079 2.985315 2.027938
H  -4.464863 -4.630237 1.272468
H  -5.359624 4.021187 0.072168
H  7.157339 -0.17915 -1.368014
H  7.033879 -1.568623 -0.231603
H  8.332401 -0.189349 1.494709
H  9.252741 -0.686272 0.028427
H  8.672044 1.636708 -0.696814
