program: Orca
programVersion: 5.0.2
elementType: Cl O N N N C C C C C C C C C C C C C C C C H H H H H H H H H H H H H H H H H H H H H H H
charge: 1
multiplicity: 1
keywords: wb97x-d3
keywords: def2-TZVPP
keywords: def2/J RIJCOSX
keywords: DEFGRID2
keywords: scfconv7
keywords: smallprint printgap noloewdin
keywords: NOSOSCF
formula: C16H23ClN3O
InChI: InChI=1/C16H23ClN3O/c1-15(2,3)16(21,10-20-12-18-11-19-20)9-8-13-4-6-14(17)7-5-13/h4-7,11-12,18,21H,8-10H2,1-3H3
44 atoms
Cl -3.829392 -3.90808 1.112528
O  0.674227 0.494476 1.134136
N  1.10942 3.00384 -0.099833
N  0.917952 3.553041 -1.313381
N  -0.530099 4.31848 0.120102
C  1.594066 0.562977 0.062207
C  2.782101 -0.43595 0.298254
C  0.914261 0.304308 -1.308128
C  2.134039 1.996996 0.135666
C  2.232475 -1.848169 0.530387
C  3.727802 -0.473977 -0.905713
C  3.600583 -0.050896 1.536605
C  -0.602296 0.523411 -1.395247
C  -1.42122 -0.576196 -0.770802
C  0.237585 3.45494 0.771733
C  -1.358764 -1.877181 -1.267881
C  -2.258652 -0.331381 0.313786
C  -0.088775 4.352786 -1.159285
C  -2.094641 -2.904996 -0.699635
C  -3.002853 -1.346562 0.898406
C  -2.91089 -2.629285 0.386517
H  1.107069 -0.720147 -1.628095
H  1.402435 0.923377 -2.063248
H  2.541779 2.209493 1.121647
H  2.914972 2.17223 -0.598696
H  3.062554 -2.553547 0.586797
H  1.577975 -2.191531 -0.272512
H  1.684757 -1.935183 1.470512
H  4.137028 0.506884 -1.151807
H  3.250757 -0.870686 -1.801852
H  4.574996 -1.123648 -0.68078
H  4.299161 -0.854226 1.775498
H  4.199509 0.847933 1.383042
H  2.973982 0.105047 2.415694
H  -0.851223 0.573755 -2.458024
H  -0.914736 1.478359 -0.973854
H  0.223257 -0.356522 1.124007
H  0.172317 3.201312 1.816321
H  -0.723785 -2.101269 -2.116789
H  -2.334425 0.670727 0.717566
H  -0.521118 4.970297 -1.928115
H  -2.030568 -3.906831 -1.102389
H  -3.641692 -1.132806 1.744394
H  -1.29743 4.847822 0.517945
elementType: Cl O N C H
totalener: -1323.18466353 hartree
nucrepener: 1903.52234051 hartree
electener: -3226.70700404 hartree
oneelecener: -5567.85032525 hartree
twoeener: 2341.14332121 hartree
cpcmener: -0.11761318 hartree
kineticenergy: 1318.50401799 hartree
xcener: -106.546719233849 hartree
chargesum: 1.0000000
charge: -0.104804 -0.454165 0.122275 -0.299658 -0.084246 0.451822 0.208398 -0.284612 -0.203626 -0.372848 -0.354849 -0.370999 -0.074411 0.037155 0.180870 -0.276339 -0.208101 0.149589 -0.125951 -0.140745 0.085877 0.114596 0.118855 0.154878 0.141527 0.103958 0.105537 0.099813 0.102807 0.098360 0.101979 0.101409 0.097562 0.098898 0.112592 0.086982 0.236838 0.212363 0.146162 0.148915 0.198951 0.145225 0.143801 0.247358
qa: -0.1048 -0.4542 0.1223 -0.2997 -0.0842 0.4518 0.2084 -0.2846 -0.2036 -0.3728 -0.3548 -0.3710 -0.0744 0.0372 0.1809 -0.2763 -0.2081 0.1496 -0.1260 -0.1407 0.0859 0.1146 0.1189 0.1549 0.1415 0.1040 0.1055 0.0998 0.1028 0.0984 0.1020 0.1014 0.0976 0.0989 0.1126 0.0870 0.2368 0.2124 0.1462 0.1489 0.1990 0.1452 0.1438 0.2474
va: 1.1999 1.9891 3.4584 2.8861 3.5584 3.6189 3.8128 3.8855 3.8483 3.9214 3.9384 3.9145 3.8317 3.5180 3.9139 3.9883 3.9277 3.9388 3.9541 3.9994 3.8240 1.0050 1.0093 0.9932 1.0111 1.0072 1.0032 1.0069 1.0044 1.0020 1.0038 1.0043 0.9962 1.0219 1.0041 1.0071 1.0145 0.9820 1.0031 0.9997 0.9788 1.0035 1.0055 0.9652
dispersion: -0.026050794 hartree
energy: -1323.210714319008 hartree
dipole: 31.74140 -30.71042 1.03098 9.04916 -2.22190 6.82726 -3.87957 3.90909 0.02952
magnitude: 6.90473 au
magnitude: 17.55042 debye
