program: Orca
programVersion: 5.0.2
elementType: Cl O N N N C C C C C C C C C C C C C C C C H H H H H H H H H H H H H H H H H H H H H H H
charge: 1
multiplicity: 1
keywords: wb97x-d3
keywords: def2-TZVPP
keywords: def2/J RIJCOSX
keywords: DEFGRID2
keywords: scfconv7
keywords: smallprint printgap noloewdin
keywords: NOSOSCF
formula: C16H23ClN3O
InChI: InChI=1/C16H23ClN3O/c1-15(2,3)16(21,10-20-12-18-11-19-20)9-8-13-4-6-14(17)7-5-13/h4-7,11-12,18,21H,8-10H2,1-3H3
44 atoms
Cl -3.861743 -3.656965 1.092078
O  0.751119 0.241545 1.041203
N  1.034917 2.823972 -0.067573
N  0.933351 3.461538 -1.248467
N  -0.750465 3.950347 0.041772
C  1.752712 0.43632 0.061375
C  3.009478 -0.448966 0.387774
C  1.238279 0.146121 -1.371001
C  2.135551 1.914078 0.21887
C  3.670381 -0.022785 1.70453
C  2.5846 -1.91495 0.544452
C  4.05897 -0.365135 -0.724597
C  -0.258597 0.316331 -1.658536
C  -1.161489 -0.677955 -0.978639
C  0.019863 3.106532 0.716914
C  -1.011013 -2.047574 -1.187746
C  -2.174551 -0.254365 -0.122634
C  -0.164086 4.144145 -1.163766
C  -1.835606 -2.969308 -0.559596
C  -3.012744 -1.158867 0.512087
C  -2.830139 -2.514053 0.291281
H  1.498496 -0.875427 -1.651602
H  1.792724 0.773712 -2.072175
H  2.448469 2.128462 1.238493
H  2.945447 2.19379 -0.448613
H  4.196024 0.929958 1.623831
H  4.414587 -0.766604 1.994455
H  2.953734 0.052023 2.523819
H  3.473012 -2.535382 0.67266
H  2.048507 -2.304061 -0.322648
H  1.961577 -2.076406 1.425822
H  4.38894 0.656745 -0.918195
H  4.943766 -0.932935 -0.430567
H  3.707419 -0.787152 -1.666209
H  -0.372654 0.200345 -2.739809
H  -0.618346 1.320698 -1.440987
H  0.373464 -0.640505 0.948728
H  -0.148409 2.757484 1.721806
H  -0.237259 -2.411641 -1.853189
H  -2.311235 0.804913 0.060331
H  -0.565053 4.78594 -1.929825
H  -1.699978 -4.027958 -0.735248
H  -3.791526 -0.806289 1.174726
H  -1.613762 4.362384 0.379085
elementType: Cl O N C H
totalener: -1323.18452726 hartree
nucrepener: 1912.77521985 hartree
electener: -3235.95974711 hartree
oneelecener: -5586.06420915 hartree
twoeener: 2350.10446203 hartree
cpcmener: -0.11821820 hartree
kineticenergy: 1318.48339639 hartree
xcener: -106.543276762619 hartree
chargesum: 1.0000000
charge: -0.106230 -0.450619 0.127220 -0.302059 -0.082065 0.438418 0.214064 -0.278609 -0.200745 -0.370328 -0.376699 -0.356720 -0.075087 0.046491 0.177569 -0.284401 -0.211301 0.152387 -0.116426 -0.126684 0.075259 0.118010 0.115191 0.158198 0.138304 0.097599 0.101169 0.098448 0.103978 0.105722 0.099967 0.102172 0.101685 0.098683 0.112165 0.078359 0.237591 0.211155 0.147284 0.147214 0.198045 0.145137 0.143097 0.247391
qa: -0.1062 -0.4506 0.1272 -0.3021 -0.0821 0.4384 0.2141 -0.2786 -0.2007 -0.3703 -0.3767 -0.3567 -0.0751 0.0465 0.1776 -0.2844 -0.2113 0.1524 -0.1164 -0.1267 0.0753 0.1180 0.1152 0.1582 0.1383 0.0976 0.1012 0.0984 0.1040 0.1057 0.1000 0.1022 0.1017 0.0987 0.1122 0.0784 0.2376 0.2112 0.1473 0.1472 0.1980 0.1451 0.1431 0.2474
va: 1.1980 1.9903 3.4523 2.8831 3.5563 3.6566 3.7843 3.8983 3.8471 3.9150 3.9248 3.9403 3.8373 3.5423 3.9112 3.9971 3.9513 3.9368 3.9452 3.9831 3.8280 1.0049 1.0087 0.9913 1.0131 0.9960 1.0041 1.0221 1.0071 1.0025 1.0075 1.0044 1.0038 1.0016 1.0040 1.0155 1.0122 0.9845 1.0018 0.9976 0.9796 1.0039 1.0056 0.9652
dispersion: -0.026429051 hartree
energy: -1323.210956310113 hartree
dipole: 33.50729 -32.85194 0.65535 8.07878 -1.84357 6.23521 -3.42832 3.34976 -0.07856
magnitude: 6.27005 au
magnitude: 15.93720 debye
