program: Orca
programVersion: 5.0.2
elementType: N C C C C C C C C C C C C C C C C C C C C C H H H H H H H H H H H H H H H H H H H H H H H H H H
charge: 1
multiplicity: 1
keywords: wb97x-d3
keywords: def2-TZVPP
keywords: def2/J RIJCOSX
keywords: DEFGRID2
keywords: scfconv7
keywords: smallprint printgap noloewdin
keywords: NOSOSCF
formula: C21H26N
InChI: InChI=1/C21H26N/c1-21(2,3)15-8-5-9-16-22(4)17-19-13-10-12-18-11-6-7-14-20(18)19/h5-7,9-14,22H,16-17H2,1-4H3
48 atoms
N  1.896049 -1.252192 -0.262507
C  3.079645 -0.310587 -0.280524
C  2.671962 1.08981 -0.618141
C  2.488926 2.092535 0.377508
C  2.070675 3.385037 -0.042552
C  -5.012101 -3.080644 -0.450028
C  0.898968 -0.933146 0.833786
C  2.472692 1.391922 -1.944346
C  2.703285 1.88078 1.760282
C  2.333582 -2.669416 -0.223714
C  1.855687 3.640754 -1.414272
C  2.055286 2.668104 -2.351947
C  1.879711 4.402007 0.919918
C  -5.917978 -2.17998 -1.29799
C  -5.662153 -3.339913 0.916345
C  -4.766707 -4.410832 -1.174547
C  -0.35565 -1.717068 0.680863
C  2.511824 2.886172 2.667148
C  2.092597 4.161394 2.246586
C  -3.730165 -2.409441 -0.241239
C  -1.449725 -1.180336 0.123463
C  -2.67109 -1.860654 -0.061602
H  3.761214 -0.701369 -1.03671
H  3.57635 -0.411313 0.682951
H  1.409631 -1.136126 1.776525
H  0.707339 0.136824 0.772824
H  2.659117 0.639557 -2.704317
H  3.041654 0.920114 2.126187
H  3.005678 -2.863916 -1.055442
H  1.469378 -3.322452 -0.300235
H  2.853081 -2.855481 0.713331
H  1.538523 4.630802 -1.716997
H  1.907226 2.87608 -3.402198
H  1.564302 5.382516 0.586299
H  -6.880377 -2.668209 -1.455984
H  -5.47839 -1.97963 -2.274907
H  -6.102422 -1.225488 -0.805621
H  -5.84188 -2.409771 1.454682
H  -6.622084 -3.838258 0.775759
H  -5.038679 -3.979607 1.540442
H  -4.298649 -4.254608 -2.146318
H  -4.127152 -5.071233 -0.589244
H  -5.716655 -4.92109 -1.338057
H  -0.38647 -2.73232 1.057008
H  2.690768 2.701891 3.71788
H  1.947406 4.947072 2.974903
H  -1.42136 -0.144568 -0.210203
H  1.392045 -1.106605 -1.140688
totalener: -870.41510535 hartree
nucrepener: 1635.39122036 hartree
electener: -2505.80632570 hartree
oneelecener: -4402.79874698 hartree
twoeener: 1896.99242128 hartree
kineticenergy: 866.24341979 hartree
xcener: -89.071494116974 hartree
chargesum: 1.0000000
charge: 0.182917 -0.196252 0.101577 -0.087414 -0.033104 -0.022266 -0.157629 -0.179329 -0.195465 -0.183213 -0.071258 -0.117855 -0.038030 -0.255204 -0.252755 -0.255974 -0.193760 -0.097926 -0.111081 -0.156043 -0.145374 0.202383 0.158847 0.156403 0.151769 0.158350 0.135000 0.111924 0.133646 0.142099 0.135234 0.130026 0.146908 0.126452 0.098192 0.096032 0.099340 0.101319 0.098387 0.095755 0.096673 0.094278 0.099933 0.136837 0.141212 0.146463 0.120148 0.151829
qa: 0.1829 -0.1963 0.1016 -0.0874 -0.0331 -0.0223 -0.1576 -0.1793 -0.1955 -0.1832 -0.0713 -0.1179 -0.0380 -0.2552 -0.2528 -0.2560 -0.1938 -0.0979 -0.1111 -0.1560 -0.1454 0.2024 0.1588 0.1564 0.1518 0.1583 0.1350 0.1119 0.1336 0.1421 0.1352 0.1300 0.1469 0.1265 0.0982 0.0960 0.0993 0.1013 0.0984 0.0958 0.0967 0.0943 0.0999 0.1368 0.1412 0.1465 0.1201 0.1518
va: 3.6055 3.8299 3.3752 3.8511 4.0056 4.1384 3.8894 4.0259 3.9522 3.8557 3.9961 4.0120 3.9236 3.8958 3.8939 3.8961 3.8519 4.0253 3.9894 3.9918 4.0680 3.7169 0.9976 1.0030 0.9998 1.0070 1.0044 1.0143 0.9991 0.9991 0.9940 1.0099 0.9988 1.0111 1.0069 1.0081 1.0079 1.0076 1.0066 1.0083 1.0074 1.0082 1.0075 1.0119 0.9993 0.9971 1.0024 1.0185
dispersion: -0.020613544 hartree
energy: -870.435718890757 hartree
dipole: -17.46048 19.53114 2.07066 -22.03187 20.71778 -1.31408 -1.82712 1.56067 -0.26645
magnitude: 2.46687 au
magnitude: 6.27028 debye
