program: Orca
programVersion: 5.0.2
elementType: N C C C C C C C C C C C C C C C C C C C C C H H H H H H H H H H H H H H H H H H H H H H H H H H
charge: 1
multiplicity: 1
keywords: wb97x-d3
keywords: def2-TZVPP
keywords: def2/J RIJCOSX
keywords: DEFGRID2
keywords: scfconv7
keywords: smallprint printgap noloewdin
keywords: NOSOSCF
formula: C21H26N
InChI: InChI=1/C12H13N.C9H13/c1-13-9-11-7-4-6-10-5-2-3-8-12(10)11;1-5-6-7-8-9(2,3)4/h2-8,13H,9H2,1H3;5-6H,1H2,2-4H3
48 atoms
N  0.129664 -1.876423 -2.519036
C  0.147068 -2.027362 -1.0842
C  1.257343 -1.228995 -0.455944
C  1.335833 0.193241 -0.61524
C  2.427361 0.893034 -0.038422
C  -3.512685 0.541628 0.403088
C  2.118686 -0.158383 3.039187
C  2.264114 -1.891218 0.216666
C  0.354242 0.930209 -1.305918
C  -0.92711 -2.633267 -3.156166
C  3.413987 0.172941 0.672591
C  3.340771 -1.203073 0.783457
C  2.499749 2.295732 -0.156317
C  -3.474278 2.055741 0.166703
C  -4.670582 0.175324 1.348597
C  -3.672152 -0.205926 -0.930931
C  0.929344 0.270777 2.524586
C  0.443133 2.297478 -1.393557
C  1.519526 2.988455 -0.815575
C  -2.269856 0.111282 1.023135
C  -0.036633 -0.642832 2.109192
C  -1.23838 -0.253875 1.550601
H  0.233209 -3.074712 -0.751503
H  -0.817508 -1.672793 -0.70036
H  2.86204 0.540395 3.395622
H  2.302451 -1.204865 3.240952
H  2.225559 -2.970677 0.297452
H  -0.442456 0.406646 -1.812677
H  -0.863248 -2.509743 -4.235565
H  -1.899262 -2.247598 -2.842848
H  -0.91189 -3.708638 -2.934731
H  4.268368 0.70471 1.074711
H  4.132026 -1.749139 1.280473
H  3.342442 2.819963 0.277302
H  -3.368439 2.603491 1.102428
H  -4.402846 2.375791 -0.30637
H  -2.64808 2.334941 -0.487151
H  -4.718641 -0.897682 1.528824
H  -4.580391 0.682891 2.308127
H  -5.610617 0.485368 0.891355
H  -2.863857 0.032574 -1.622632
H  -3.698679 -1.285642 -0.786626
H  -4.609626 0.095316 -1.398971
H  0.748525 1.326753 2.373296
H  -0.313565 2.849569 -1.935125
H  1.580361 4.064221 -0.905961
H  0.124523 -1.701564 2.289713
H  1.027466 -2.13102 -2.908095
totalener: -870.35007518 hartree
nucrepener: 1807.41199558 hartree
electener: -2677.76207076 hartree
oneelecener: -4746.59015084 hartree
twoeener: 2068.82808008 hartree
kineticenergy: 866.24476301 hartree
xcener: -89.027326790378 hartree
chargesum: 1.0000000
charge: -0.245168 -0.015176 0.062799 0.081932 -0.067506 0.027331 -0.119762 -0.131503 -0.285510 -0.171358 -0.135518 -0.123357 -0.056715 -0.237446 -0.248751 -0.314964 -0.007554 -0.088627 -0.116226 -0.158427 -0.096110 0.267506 0.091753 0.091696 0.160454 0.145618 0.130692 0.154147 0.111992 0.077250 0.091924 0.155218 0.167210 0.129590 0.106895 0.109222 0.084166 0.108294 0.110170 0.106552 0.097851 0.114505 0.119256 0.145390 0.149787 0.148848 0.160325 0.111305
qa: -0.2452 -0.0152 0.0628 0.0819 -0.0675 0.0273 -0.1198 -0.1315 -0.2855 -0.1714 -0.1355 -0.1234 -0.0567 -0.2374 -0.2488 -0.3150 -0.0076 -0.0886 -0.1162 -0.1584 -0.0961 0.2675 0.0918 0.0917 0.1605 0.1456 0.1307 0.1541 0.1120 0.0772 0.0919 0.1552 0.1672 0.1296 0.1069 0.1092 0.0842 0.1083 0.1102 0.1066 0.0979 0.1145 0.1193 0.1454 0.1498 0.1488 0.1603 0.1113
va: 2.9078 3.8490 3.4308 3.6441 3.8451 4.0981 3.9120 3.8709 4.0197 3.9550 3.8518 3.8396 3.9136 3.8805 3.8878 3.9006 3.6741 3.9841 4.0130 3.9730 4.0560 3.5790 1.0063 0.9782 0.9936 0.9971 1.0137 1.0406 1.0001 0.9903 0.9916 1.0043 0.9928 1.0100 1.0077 1.0080 1.0182 1.0054 1.0056 1.0050 1.0080 0.9994 1.0130 1.0048 0.9938 0.9961 0.9845 1.0316
dispersion: -0.028223027 hartree
energy: -870.378298204793 hartree
dipole: -18.54886 18.96199 0.41313 -3.77637 3.46195 -0.31442 -4.01137 5.62433 1.61296
magnitude: 1.69446 au
magnitude: 4.30698 debye
