program: Orca
programVersion: 5.0.2
elementType: N C C C C C C C C C C C C C C C C C C C C C H H H H H H H H H H H H H H H H H H H H H H H H H H
charge: 1
multiplicity: 1
keywords: wb97x-d3
keywords: def2-TZVPP
keywords: def2/J RIJCOSX
keywords: DEFGRID2
keywords: scfconv7
keywords: smallprint printgap noloewdin
keywords: NOSOSCF
formula: C21H26N
InChI: InChI=1/C21H26N/c1-21(2,3)15-8-5-9-16-22(4)17-19-13-10-12-18-11-6-7-14-20(18)19/h5-7,9-14,22H,16-17H2,1-4H3
48 atoms
N  2.326795 -1.239118 -0.320249
C  2.116152 -0.916535 1.142777
C  2.383355 0.526342 1.423096
C  1.476463 1.522774 0.958278
C  1.799882 2.886596 1.184355
C  -4.615675 -1.66509 -1.201061
C  1.7115 -2.563909 -0.71744
C  3.51313 0.888252 2.112047
C  0.267314 1.22435 0.285028
C  3.756504 -1.157864 -0.70707
C  2.977648 3.213696 1.893938
C  3.812036 2.239193 2.360519
C  0.929867 3.89263 0.709505
C  -5.095859 -2.248284 0.13334
C  -5.322508 -2.3657 -2.368783
C  -4.897768 -0.156162 -1.247949
C  0.231913 -2.544894 -0.549927
C  -0.555355 2.222758 -0.162526
C  -0.218559 3.572339 0.04171
C  -3.173508 -1.869147 -1.324052
C  -0.582903 -2.160988 -1.542079
C  -1.981555 -2.029693 -1.41956
H  2.7818 -1.571698 1.705378
H  1.090583 -1.195671 1.381669
H  1.995388 -2.733056 -1.756804
H  2.195295 -3.327114 -0.106763
H  4.189115 0.124256 2.478253
H  -0.059334 0.199795 0.14841
H  3.84717 -1.292024 -1.78172
H  4.307479 -1.943795 -0.195601
H  4.154549 -0.187469 -0.425326
H  3.207651 4.256766 2.071134
H  4.703423 2.497357 2.914596
H  1.185005 4.929561 0.887919
H  -4.605332 -1.765769 0.978677
H  -4.901248 -3.318844 0.192275
H  -6.17082 -2.09658 0.236845
H  -6.399574 -2.213838 -2.28932
H  -4.996054 -1.968542 -3.329471
H  -5.133226 -3.438659 -2.361856
H  -5.970457 0.019036 -1.158729
H  -4.404208 0.366579 -0.428171
H  -4.562453 0.282233 -2.187778
H  -0.185985 -2.839094 0.404969
H  -1.479354 1.969029 -0.66499
H  -0.876528 4.351694 -0.316675
H  -0.160224 -1.912618 -2.514475
H  1.822048 -0.517986 -0.843374
totalener: -870.41693239 hartree
nucrepener: 1684.65985696 hartree
electener: -2555.07678934 hartree
oneelecener: -4501.02223673 hartree
twoeener: 1945.94544738 hartree
kineticenergy: 866.24480303 hartree
xcener: -89.074173960936 hartree
chargesum: 1.0000000
charge: 0.161800 -0.193332 0.036956 -0.082133 -0.045752 -0.005669 -0.134282 -0.142249 -0.217166 -0.193847 -0.073104 -0.093009 -0.037410 -0.255975 -0.253291 -0.269121 -0.142950 -0.122423 -0.116286 -0.152527 -0.211619 0.217539 0.146246 0.183393 0.141850 0.147985 0.128423 0.153388 0.136939 0.130365 0.156436 0.130359 0.147733 0.128258 0.091795 0.101517 0.099877 0.098901 0.098849 0.102306 0.104393 0.089516 0.100497 0.135946 0.138413 0.145486 0.122441 0.164539
qa: 0.1618 -0.1933 0.0370 -0.0821 -0.0458 -0.0057 -0.1343 -0.1422 -0.2172 -0.1938 -0.0731 -0.0930 -0.0374 -0.2560 -0.2533 -0.2691 -0.1429 -0.1224 -0.1163 -0.1525 -0.2116 0.2175 0.1462 0.1834 0.1419 0.1480 0.1284 0.1534 0.1369 0.1304 0.1564 0.1304 0.1477 0.1283 0.0918 0.1015 0.0999 0.0989 0.0988 0.1023 0.1044 0.0895 0.1005 0.1359 0.1384 0.1455 0.1224 0.1645
va: 3.5742 3.8194 3.4164 4.0089 4.0282 4.1214 3.8682 3.9908 3.9421 3.8557 3.9884 3.9792 3.9241 3.8969 3.8959 3.9024 3.7836 4.0614 3.9902 3.9711 4.0641 3.6628 1.0088 0.9798 1.0016 1.0039 1.0083 1.0099 0.9985 0.9978 0.9919 1.0100 0.9979 1.0105 1.0076 1.0073 1.0073 1.0061 1.0076 1.0075 1.0090 1.0073 1.0059 1.0182 1.0027 0.9979 1.0025 1.0184
dispersion: -0.022138538 hartree
energy: -870.439070924254 hartree
dipole: -13.55565 16.20079 2.64514 -12.45651 11.31449 -1.14202 -6.57893 6.20814 -0.37080
magnitude: 2.90491 au
magnitude: 7.38369 debye
